Friday, October 26, 2012

Bugs Fixed in 11.1.1.6.5 Patch Set


Hi,


Patch 14696072 (1 of 7) Oracle Business Intelligence Installer
  Patch 14733356 (2 of 7) Oracle Real Time Decisions
  Patch 14678543 (3 of 7) Oracle Business Intelligence Publisher
  Patch 14733390 (4 of 7) Oracle Business Intelligence ADF Components
  Patch 14733413 (5 of 7) Enterprise Performance Management Components Installed from BI Installer 11.1.1.6.x
  Patch 14665284 (6 of 7) Oracle Business Intelligence
  Patch 14733370 (7 of 7) Oracle Business Intelligence Platform Client Installers and MapViewer

Business Intelligence Suite Enterprise Edition - Version 11.1.1.6.5 to 11.1.1.6.5 [Release 11g]

This note provides a list of the bugs fixed in each of the patches as part of OBIEE 11.1.1.6.5 patch set.



Note: un-linked bugs are internal only and not publicly available

Patch 14696072 (1 of 7) Oracle Business Intelligence Installer

bug 13404296 - BI PROVISIONING FACADE MUST TRIM RPD IN INSTANCE FOR SELECTED FA OFFERINGS
bug 13485655 - T2P ERROR MSG EXECUTING WLST SCRIPT APPEARS DURING BIINSTANCE PASTECONFIG
bug 13504454 - BLK - BIINSTANCE COPYCONFIG FAILURE ESSBASE MAXL LOGIN IS FAILING
bug 13510938 - NEED OFFICIAL WAY TO INVOKE _CONFIGURERPD
bug 13560245 - BIDOMAIN/CONFIG/JDBC NOT FOUND.
bug 13565722 - BLK: BI T2P PASTECONFIG ERRORED OUT WITH UNABLE TO PARSE JMS_WEBLOGIC_JNDI_URL
bug 13589944 - BI T2P - PASTECONFIG INSTANCE IS FAILING WITH JAVA.LANG.UNSATISFIEDLINKERROR
bug 13619973 - INCLUDE ESSSERVER HOST NAME IN THE MOVEPLAN
bug 13628293 - EMPTY PROCUREMENT DASHBOARD IN RC4
bug 13683204 - STRESS:FA:CRM ERROR RESPONSE[NQSERROR: 43082] ILLEGAL OPERATION ATTEMPTED CLOSED
bug 13687239 - RUP2_RC4 BI DOMAIN - BI ANALYTICS DATASOURCE TEST FAILS
bug 13724975 - RUP2 AIX HCM STARTERDB POSTCONFIGURE FAILED
bug 13779029 - BI T2P BI RPD PLUGIN OPERATION ERROR WHILE LOADING SHARED LIBRARIES LIBARICU23
bug 13780076 - USE BIPROV PROPERTIES FROM 13694505
bug 13896014 - RPDTRIM INCORRECT PROPERTY BIPROV.BI-HOME.DIR IN BI-CONTENT.XML FILE
bug 13896152 - TRIMRPD NOT ABLE TO CREATE BIPROJECTS.TXT BASED ON FAOFFERING LIST BAD XPATH ERR
bug 13896209 - TRIMRPD RELATIVE BI ORACLE HOME LOCATION PASSED TO SCRIPTS DURING RPDTRIM
bug 13898786 - TRIMRPD PLEASE MASK THE RPD PASSWORD WHICH IS LOGGED DURING _TRIMRPDTARGET EXEC
bug 13910554 - MISSING CONNECTION PROPERTIES IN OBIEE RPD
bug 13926479 - TRIMRPD FOR WINDOWS THE PROPS FILE SHOULD INCLUDE FORWARD SLASH IN DIR PATHS

Patch 14733356 (2 of 7) Oracle Real Time Decisions

bug 9157691 - SERVER NEED TO RESPOND WHEN THE TIMEOUT EXPIRES, NOT WAIT TILL END OF REQUEST
bug 13240778 - QA- ACCESS- ERE- RGRN- ERROR ACCESSING LOV VIA KEY; CAN'T SELECT VIA KEY
bug 13347251 - QA-UNABLE TO SEE ERE IN DYNAMIC PAGE IN SAFARI CHROME
bug 13360752 - UNABLE TO LOAD ALL EXTENSION COLUMNS FOR CUSTOMER IN RTD STUDIO
bug 13408870 - QA-SDCONFIG 3X VALUES COPIED TO 11G BUT NOT USED THERE
bug 13409526 - QA-UPDATE DOC COPYRTDDATA_README.TXT FOR STOP START 11G
bug 13472560 - QA-ACCESS-HIGH CONTRAST SETTING APPEARS CLUTTERED, SOME ITEMS NOT VISIBLE
bug 13506987 - COPYRIGHT INFORMATION NEEDS TO BE EXTENDED TO 2012
bug 13537093 - INTERNAL SERVER ERROR SHOWS WHEN CLICK PRINT AT CHOICE GROUP>ANALYSIS>QUALITY
bug 13539353 - INTERNAL ERROR(npe) FOR ENTITY STATISTIC
bug 13567294 - REMOVED 1ST VALUE IN RULE BECOMES NAN
bug 13703826 - RTD CAUSES BI_SERVER1 TO START TAKES LONG RIGHT AFTER UPGRADE TO 11.1.1.6.0
bug 13723256 - RUP2- ERROR WHILE ACCESSING ORACLE RTD AFTER RUP2 PATCHING
bug 13779138 - RULE EDITOR DOES NOT DISPLAY DATE IN OPERAND
bug 13780656 - NEW STUDIO HELP FILES FOR 11.1.1.6.2
bug 13795529 - RTD RULE EDITOR ERROR-CANNOT MOVE FOCUS TO THE CONTROL
bug 13805360 - ATTRIBUTE TRANSLATIONS NOT SEEN IN ADF RULES EDITOR
bug 13816544 - RE ERROR WHEN SELECTING DOUBLE WITHOUT DECIMAL

Patch 14678543 (3 of 7) Oracle Business Intelligence Publisher

bug 9616238 - ACC: INCONSISTENT READING OF EXPANDED/COLLAPSED NODES ON TREE VIEW
bug 9706193 - ACC: NON COMPLIANT LINKS/PAGES SHOULD BE HIDDEN WHEN ACCESSIBLE MODE IS ON
bug 9706403 - ACC: CATALOG TREE STRUCTURE IS NOT READ CORRECTLY BY JAWS
bug 10022187 - ACC: SELECTED ITEM IN FOLDERS PANE GETS LOST AFTER USING UP/DOWN ARROW TOO MUCH
bug 10046249 - ACC: SCHEDULE PAGES HAVE GRIDTABLE TABLES THAT CAN'T BE NAVIGATED
bug 11678983 - LDAP CONFIG ASSUMES THAT ADMIN IS DEFINED UNDER USERS
bug 11906714 - QA TIMEZONE NOT IN SYNC IN JOB
bug 12312461 - NLS MB DATA GARBLED IN JOB HISTORY
bug 12542914 - ACC: REPORT VIEWER STRUCTURE HAS ERRORS - NO IFRAME AND NO LANG ATTRIBUTE
bug 12645567 - NLS WRONG WEEK OF YEAR FOR ORACLE
bug 12825409 - INTERATIVE VIEWER CONDITIONAL FORMA
bug 12963915 - DEVICE LOCALE INFORMATION NOT SENT TO BIPUBLISHER REPORTS
bug 13076183 - BI MOBILE CANNOT LOAD BIPUBLISHER REPORTS PARAMETER TRANSLATION
bug 13341249 - BACKGROUND ON SCHEDULED REPORT
bug 13371841 - QA ACTIONS DROPDOWN NOT SHOW CORRECT
bug 13445281 - NLSHOT PREVIOUS 11G VERSION XLF FOR RTF TEMPLATE CANNOT WORK WELL ON 11.1.1.6
bug 13449368 - WEBPAGE ERROR WHEN EDIT DATA MODEL IN BIP
bug 13473493 - XMLP TRANSLATION ISSUE OF MILLION
bug 13481659 - CANT SAVE ON BI DEV ENV RC2
bug 13499336 - PSR PERF BIP GRADUAL CPU REGRESSION
bug 13501838 - ORA-00923 ISSUE WHEN CREATING A BIP
bug 13507141 - QA JOB MANAGER FAILS TO GET DATA
bug 13516890 - CONDITIONAL FORMATTING IN TABLE FAIL
bug 13526752 - CANNOT REMOVE BLANK SPACE FROM
bug 13533419 - EMAIL DELIVERY THROWING NULLPOINTER
bug 13533646 - MULTIPLE LABELS THAT HAVE OVERRIDDEN LABEL SEPERATOR NOT FILTERING CORRECTLY
bug 13553275 - ASSIGNROLESTOUSER OF PUBLISHER WEB
bug 13555124 - QA DB2 EVN THROWS ERROR FOR
bug 13558099 - CARRIAGE RETURN AND LINE FEED
bug 13562801 - XML TAG DISPLAY SHOULD DEFAULT
bug 13563977 - BIP TEMPLATE RUN FROM UI GIVE NPE ERROR
bug 13568043 - BIP QUERY FAILING VALIDATION DUE TO
bug 13568517 - DYNAMIC URL CUT OFF AFTER FIRST
bug 13569910 - NLS FR REPORT CREATION WIZARD
bug 13570370 - BIINST: BIP - LOGIN PAGE SHOWING INCORRECT COPYRIGHT YEAR AFTER THE UPGRADE
bug 13570702 - BI PUBLISHER REPORT HEADER OUTPUT
bug 13571066 - BI PUBLISHER GAUGE GRAPHICS INSERTS
bug 13583737 - STYLE TEMPALTE DOESNOT WORK WITH
bug 13592512 - TRELLIS REPORT EDITOR EXPORT PDF TRELLIS RIGHTSIDE COLS CUTOFF IN PDF
bug 13592901 - THE REPORT IS THROWING AND SQL ERROR
bug 13611515 - CANT SEE PERMMISIONS FOR JAPANESE
bug 13631467 - RGRN LABELS INCORRECT IN JOBMANAGER
bug 13631491 - GENERATE REPORT FAILED DUE TO INVALID FORMAT REQUESTED: HTML
bug 13639626 - STRESS FA PRJ BI_SERVER CONSUMING HIGH CPU DURING THE TEST
bug 13647553 - FABIEAP-CUST USER WITH BI AUTHOR ROLE GETS ERROR WHEN CREATING A NEW DATA MODEL
bug 13652416 - SUPPORT DUMMY DELIVERY IN SCHEDULER
bug 13687764 - PS5 RUP2ST2 CDRM: BIP REPORTS ENDS WITH ERROR FOR KO USER
bug 13688312 - RUP2 ADMINISTRATION OF BI PUBLISHER VIA ANALYTICS THROWS EXCEPTION
bug 13689978 - QA AUTO OLB COUNT DISTINCT INCORRECT
bug 13700272 - IN DASHBOARD OPEN THE BIPBULISHER PDF REPORT ERROR 'UNAUTHORIZED ACCESS'
bug 13703356 - BIP CAUSES BI_SERVER1 TO TAKE LONG TO START RIGHT AFTER UPGRADE TO 11.1.1.6.0
bug 13709127 - DYNAMIC IMAGE IS NOT RENDERED IN
bug 13716804 - STRESS FA PRJ CONCURRENTMODIFICATION
bug 13723565 - REG FAILES COMPONENT RENDERING
bug 13724928 - BLANK PAGE IN BIP ADMINISTRATION PAGE AFTER CLICK RUNTIME CONFIG
bug 13724944 - sub template name and xliff related issue
bug 13726878 - CANCELING AN ALERT ON DATAMODEL EDITOR DOES NOT WORK
bug 13740314 - QA URL WITH QUERY PARAMETERS CORRUPTS
bug 13776707 - FIX FOR CASCADING PARAMETERS FROM BIP SIDE
bug 13780597 - TRIAL EDITION UPLOAD RESOURCE FAILS
bug 13791065 - UNGROUP OF A SUBGROUP WITH AN EXPRESSION DOES NOT WORK PROPERLY
bug 13796726 - QA PERMISSION SETTING IS NOT DISPLAYED IN THE POPUP
bug 13805870 - SHARE REPORT LINK OPTIONS DO NOT USE PROPER PARAMS WHEN USING ANALYTICS URL
bug 13805899 - REPORT LINK OPTION NO HEADER IS BROWSER SPECIFIC
bug 13811882 - QUERY BUILDER RESULTS RETURN COLUMN TYPE (APPEARS) INSTEAD OF VALUE
bug 13825925 - CANNOT COPY/PASTE DATA TABLE
bug 13826070 - DATA TABLE SORTING MIXED W/PRIORITY DOESNT WORK WELL IN INTERACTIVE VIEW
bug 13836696 - BIPUBULISHER REPORT NOT GENEREATED WHEN A TEXT FIELD STARTS WITH E
bug 13837687 - RUP3 CRM_BIP_BUG_12760448- FAILED
bug 13877850 - MHTML OUTPUT FORMAT TAKES LONG TIME FOR LARGE REPORT
bug 13877974 - QA EXTERNAL CONTROL FLAG SET SCHEDULE OPTION NOT DISABLED IN CATALOG/REPORT
bug 13879206 - DM MIGRATION ISSUES
bug 13888939 - LOV SEARCH CAUSING DB CONNECTION LEAK
bug 13904225 - XSLX ERROR DUE TO URL LINK AND USE OF LIST
bug 13910460 - INTERACTIVE VIEWER - DATAFIELD INCORRECT AGGREGATION FOR SEPERATE DS
bug 13927577 - INTERACTIVE - BUBBLE CHART SHOWS ERROR
bug 13929637 - STRESS THREAD CONTENTION IN BIP SERVER DURING CAPTURE PROJECT COST TEST
bug 13932880 - <EXPOSE-TESTPAGE> MUST BE SET TO FALSE IN XMLPSERVER.EAR ORACLE-WEBSERVICES.XML
bug 13941635 - DATAENGINE THROWS RUNTIME EXCEPTION FOR SQL QUERY CONTAINS n/a
bug 13956683 - BUG FIX 13029606 FOR BATCHINJECTION CAUSING ISSUE WITH PATCHING UTILITY
bug 13958522 - MT ACCESSING XMLPSERVER THROWS INTERNAL SERVER ERROR
bug 13998522 - INTERACTIVE VIEW DATA TABLE SORTING DOESNT WORK FROM MOBILE
bug 14002182 - BI PUBLISHER FAILS TO START WHEN CLASS IN SCANNER.XML NOT FOUND
bug 14003183 - ENHANCE LOGGING : BIP SERVER/ CLIENT TO INCLUDE WEB SERVICE ERROR STACK TRACE
bug 14004681 - ACC: STRUCTURE TEST FAILED ON REPORT VIEWER WITH BI PUBLISHER REPORT
bug 14023678 - REMOVE SAXPATH.JAR FROM CODE
bug 14039229 - BIP 11.1.1.5.0 REPORTS ARE NOT WORKING ON BIP 11.1.1.6.0=======
bug 14040357 - BI PUBLISHER WEBSERVICE NOT INCLUDING CUSTOM FILTER
bug 14040410 - DELIVERYSERVICE CAUSED INPUTSTREAM RESET FUNCTION THROWN STREAM CLOSED EXCEPTION
bug 14055793 - BIP 11.1.1.6.0: DATE TYPE INPUT PARAMTER IS NOT DISPLAYING THE CORRECT VALUE USI
bug 14059851 - UNABLE TO GRANT PRIVILEGES TO ROLE DOMAIN USERS THE ROLE DOES NOT EXIST
bug 14095131 - CHINESE CHARACTERS IN EXPORTED CSV OUTPUT FORMAT BIP REPORT DISPLAY MESS VIA
bug 14109967 - LARGE OUTPUT CAUSES OUT OF MEMORY DUE TO LEFT OVER DEBUG CODE
bug 14119736 - ETEXT TYPE OF TEMPLATE DOES NOT GENERATE OUTPUT WHEN DEFAULT FORMAT IS TEXT
bug 14129147 - html table width look-and-feel difference from 10g to 11g, ade new rtf command <?table-layout:'auto'?> to make 10g and 11g html table look same
bug 14167915 - ORG.XML.SAX.SAXEXCEPTION DATE FORMAT CANNOT BE NULL
bug 14181601 - SLOW HTML GENERATION FOR WIDE AND LONG TABLE
bug 14238554 - 11.1.1.6.3 BIP TEMPLATE BUILDER FOR WORD SHOWS VERSION AS 11.1.1.6.2
bug 14583677 - ACC: ACTION ICONS CANNOT BE EXECUTED
bug 14583687 - ACC: THE HISTORY LINK IN THE TABLE ROW CANNOT BE CLICKED
bug 14594346 - ACC: PAGES ARE MISSING 'LANG' ATTRIBUTE IN TAG
bug 14630317 - SUPPORT ALT TEXT IN CHARTS FOR ACCESSIBLITY REQUIREMENT

Patch 14733390 (4 of 7) Oracle Business Intelligence ADF Components

bug 13365954 - ERROR WHILE OVERWRITING AN ANALYSIS VIA BI COMPOSER
bug 13597290 - 11.1.1.7.0 ESSBASE DATA CONTROL CODE IS PRINTING UNWANTED DEBUG MESSAGES
bug 13733098 - REPORTS AND ANALYTICS, CANNOT SAVE NEWLY CREATED REPORT
bug 13858848 - BIADFCOMPS ANALYSIS CREATED USING COMBINE UNION IS NOT EDITABLE IN BI COMPOSER

Patch 14733413 (5 of 7) Enterprise Performance Management Components Installed from BI Installer 11.1.1.6.x

bug 9211682 - D83:FUSION:FAILED TO REGISTER THE WEB SERVICE CONFIG MBEANS
bug 9761918 - REMOVE 'ADD SERVER' AND 'REMOVE SERVER' OPTION ON SHARED CONNECTIONS GO BUTTON M
bug 10623654 - NLS:PS1:DATE & TIME IS NOT LOCALIZED IN SCHEDULED BATCHS DETAIL INFORMATION
bug 11652873 - FUSION : ANNOTATION VIEW PANE HAS PERMISSION ISSUES FOR ANNOTATION ON TEXT
bug 11735177 - REHOSTING TOOL IS NOT TRANSFERRING PROPER USERNAME IN PARTITION DEFINITION
bug 11924085 - UNABLE TO RUN AN ESSBASE CALC SCRIPT UNDER WA
bug 12404364 - ESSBASE READ ONLY ACCESS INSUFFICIENT PRIVILEGE WITH PROMPT
bug 12530876 - PERFORMANCE ISSUE WITH FR/ESSBASE REPORTS IN 11.1.2 AS OPPOSED TO 9.3.1.X
bug 12601370 - FUSION B17: SAVED QUERY DOES NOT REFRESH, BUT NEW QUERY WORKS ON THOSE MEMBERS
bug 12765822 - DMS LOGS LOTS OF ERRORS WHEN ESSBASESERVER1 IS DOWN
bug 12810826 - B18: SMARTVIEW DRILL TO GL ALWAYS OPENS A NEW IE WINDOW DESPITE NEW TAB SETTING
bug 12834954 - INTEROP:WHEN OPEN CALCMGR FROM FA (NAVIGATOR>JOURNALS), ORCLFALANGUAGE DOES NOT
bug 13089241 - FR MAKES MULTIPLE CALLS TO WEBCAT WHEN SAVING AN OBJECT
bug 13250047 - REMOTE ADM CAN'T GET ALL MEMBERS IN LARGE GRAINED INTERFACE
bug 13427006 - [FUSION]: NAME OF BATCH AND DUPLICATE EDIT PROPERTIES SHOULD BE IN VALID FORMAT
bug 13440942 - NEED TO HAVE APPNAME IN <CALCMGRREPO> TAG FOR APP LEVEL DEPLOYMENT
bug 13475602 - OFFSET MEMBER WILL NOT SHOW ON THE RIGHT HAND SIDE OF MEMBER SELECTOR
bug 13509268 - FUSIONGL:CHANGE THE DEFAULTS IN THE ALLCOAITON WIZARD TEMPLATE
bug 13512669 - MT:HCM: XMLSTREAMREADEREXCEPTION IN BI STARTUP LOGS
bug 13552700 - ORACLE.ESSBASE.EPM.JAPI_TEMPLATE SHOULD SET REQRD EPM PROPS IN SETDOMAINENV.SH
bug 13600610 - FUSION: DRILLTHROUGH LINKS NOT SHOWING ON ALL CELLS FOR RPT WITH FUNCTIONS
bug 13614676 - CONFIGURE ESSBASE JAVAMAXOUTLINES FOR BI PLATFORM
bug 13631427 - DTE:ESSBASE CANNOT CONNECT TO BI - BIFNDNEPM TXN
bug 13684571 - INCREASE THE DEFAULT FOR JAVAMAXOUTLINES
bug 13686023 - CHILD MEMBER BECOMES INVISIBLE IF METAREAD IS SET ON PARENT MEMBER
bug 13710417 - NLS: MEDIUM DATE FORMAT FOR FR-CA SHOULD BE YYYY-MM-DD
bug 13710429 - NLS: MEDIUM DATE FORMAT FOR FR-CA SHOULD BE YYYY-MM-DD AT FLTER DIALOG
bug 13712484 - NLS:NEED TO SUPPORT FRENCH_CANADA IN RUP4
bug 13741981 - NOT STRESS:FA:FIN:EXCEL REPORTS POPUP NOT SHOWING UP IN FIREFOX
bug 13769394 - FUSION: FR UNKNOWN MEMBER ERROR IS CACHED FOR THE USER
bug 13771676 - ALLOCATIONS MEMBER SELECTOR MEMBERS ARE NOT EXAPNDING
bug 13785522 - FUSION: REPORTS DON'T FINISH W/ADV MEMB SELECTION/NEED MDX FOR FUSION DRILL
bug 13785544 - CRP2 FR MEMBER SELECTOR IN STUDIO/WORKSPACE SHOWS INCORRECT ALIASES
bug 13796767 - NMD 199: DXMDMDXRANK.SH CREATE 199 DIFFS [HP-UX IEEE FPD]
bug 13800825 - [FUSION]: FR/ADM DRIVER NEEDS TO SUPPORT MEMBERID FOR NON UNIQUE OUTLINES
bug 13801537 - TRACKING BUG FOR 11.1.2.2.001 PUSH TO BI 11.1.1.6.2
bug 13801547 - TRACKING BUG FOR 11.1.2.2.001 PUSH TO BI 11.1.1.6.2
bug 13802437 - TRACKING BUG FOR 11.1.2.2.001 PUSH TO BI 11.1.1.6.2
bug 13806230 - NULLPTR EXCEPTION WITH REGISTRYUPDATELISTENER (BIFNDNEPM PREFLIGHT)
bug 13826968 - SMBUARDESS2.SH AND SMBUARDMXL2.SH CAUSED .XCP FILE INTERMITTENTLY ON HPUX64
bug 13857776 - ESSOTLDELETEOBJECT CRASHED DURING SMARTLIST TEST ON LINUX64 AND WINDOWS32
bug 13861897 - DURING THE LOGIN TIME THE ROLE OF THE GROUP BICONSUMERS IS NOT RETURNED BACK
bug 13874086 - Fix for backward compatabillity of getdatabaseinfo
bug 13890350 - FAILED TO REINIT STUDIO CATALOG AFTER APPLIED OPATCH 13801811 TO 1.1.1.6.0
bug 13892448 - UNABLE TO RUN REPORTS ON DUPLICATED ESSBASE MEMBERS FROM HPCM WITH MDX QUERY
bug 13931693 - [FUSION]: RUP4: NEED FR SERVICE TO EXPORT/IMPORT REPORTS FROM TEST TO PRODUCTION
bug 13932923 - EXPOSE-TESTPAGE MUST BE SET TO FALSE IN HREPORTS.EAR ORACLE-WEBSERVICES.XML
bug 13932932 - EXPOSE-TESTPAGE MUST BE SET TO FALSE IN APS.EAR ORACLE-WEBSERVICES.XML
bug 13963796 - RUP3 ST3C:ESS BASE SERVER IS DOWN LS BOUNCE
bug 13964528 - RUP3ST5CDRM / PROJECTS : OLAP.SERVER.NETCONNECTRETRY ISSUE
bug 13967992 - RUP3 ST3/ST5 CDRM:CANNOT CONNECT TO ESSBASE SERVER USING REGISTRY
bug 13968116 - RUP3 ST5 CDRM: ESS FAILS TO CONNECT TO ESSBASE
bug 14073910 - GETMEMBERNAMELIST() ISSUE WHEN A RANGE OR RELATIVEMEMBER FUNCTION IS PRESENT
bug 14075520 - GETMEMBERNAMELIST() ISSUE WHEN A RANGE OR RELATIVEMEMBER FUNCTION IS PRESENT
bug 14077104 - GETMEMBERNAMELIST() ISSUE WHEN A RANGE OR RELATIVEMEMBER FUNCTION IS PRESENT
bug 14086995 - FINAP :: ESSBASE ASO OUTLINE RESTRUCTURE IS TAKING LONG TIME
bug 14230923 - APS IN BI INSTANCE GIVES THREADDEATH ERROR WHEN FORCE SHUTDOWN
bug 14252473 - CRASH ON RACE CONDITION BETWEEN ADREQAPPDBUNLOAD AND AND ADCHECKACTIVATEDB
bug 14343889 - SERVER CRASH WHEN RUNNING DATALOAD AND UNLOAD DATABASE CONCURRENTLY

Patch 14665284 (6 of 7) Oracle Business Intelligence

bug 6197675 - Provide Capability to download report with filters using GOURL action=Download
bug 7149167 - NLS:SOME DUPLICATED CURRENCY SYMBOLS IN CURRENCY SYMBOL DROPDOWN LIST
bug 9861763 - SEQUENTIAL COLOR PALETTES NEED BETTER MIX OF LIGHTS AND DARKS
bug 9916440 - SOME BIN LEVEL TEXT GETS PRINTED OUTSIDE OF FORMATTING PANE
bug 10137467 - ENABLE ZOOM TO DATA RANGE  IN OBIEE 11G
bug 10165057 - THE EDGES OF MAP VIEW GOT TRUNCATED AFTER PRINTED TO PDF OR HTML
bug 10167311 - ADD TEST CASES FOR MDSXUDML GENERATOR AND PARSER
bug 10199188 - CHARTS X AXIS LABEL IS BLURRED AT 45/60 ANGLE
bug 10391144 - WEIRD BEHAVIOUR OF FILE OPEN DIALOG ON WINDOWS 7 COMPUTER
bug 10647655 - COLUMN DATA FORMAT IS IGNORED ON WRITEBACK
bug 11810127 - ADMINTOOL TESTS FAIL EXTERNALIZATION
bug 11810367 - CONSISTENCY CHECK - OPTION TO TURN OFF (AND ON) CERTAIN WARNINGS
bug 11898882 - COLLAPSE NOT WORKING ON TABLE VIEW WITH H-COL AND MEASURE TO THE LEFT
bug 12376600 - VARIANCE CALCULATION IS WRONG.
bug 12411977 - TERADATA RANK IS NOT ALLOWED IN THE SUBQUERY
bug 12426993 - CHECKIN CONSISTENCY CHECK IS DIFFERENT FROM ADMINTOOL CONSISTENCY CHECK
bug 12543094 - EXPOSE THE SERVER ONLY CONSISTENCY CHECK IN THE ADMINTOOL UI
bug 12612904 - TOTAL PICKS VALUE IN FIRST ROW AND GIVES NOT A NUMBER WHEN AVERAGING NULL
bug 12658173 - SUMMARY ADVISOR STATS CACHE FILE NEEDS TO BE MORE ROBUST
bug 12675762 - SUMMADV SHOULD SUPPORT UNLIMITED TARGET SIZES
bug 12676628 - LD1B18 REPORTS AND ANALYTICS FACTS FOLDER STRUCTURE HIERARCHY
bug 12701483 - BAD PERFORMANCE IN A PIVOT TABLE WITH ESSBASE AND UNCHECKUSE UNQUALIFIED MEMBER
bug 12726753 - JAPANESE CHARACTERS ARE GARBLED IN PDF
bug 12737321 - INVALID CONSISTENCY CHECK WARNING [23005] IN SOME CASES
bug 12747701 - PSR:PERF:BI: REDUNDANT INDEX STATS COLLECTION STEP IN AGGR TABLES' CREATION
bug 12764126 - ST3B18: COLUMN GETS TRUNCATED WHEN EXPORT/PRINT TO PDF HAPPENS FROM VIEW SELECTOR
bug 12803999 - Fix for 12803999
bug 12810207 - QA MAP VIEW REPORT IS NOT RENDERING IN THE JSPX PAGE
bug 12813959 - Fix for 12813959
bug 12842784 - SUBJECT INFO LOGGING IN BI BROKER IS LOGGED AT SEVERE LEVEL
bug 12929662 - Fix for 12929662
bug 12961744 - B19C: RETURN LINK FROM CHILD REPORT TO PARENT NOT RENDERING THE PAGE CORRECTLY
bug 12971454 - OUTER JOIN DOES NOT WORK
bug 12978196 - COLUMN SELECTOR DOES NOT PASS VALUES FROM SUMMARY REPORT TO DETAILED REPORT
bug 12981896 - MAPVIEWER HOVER TOOLTIPS SHOW WRONG VALUES
bug 12992697 - PAGE BREAK WITH COLUMN BREAK DOES NOT WORK WHEN USE PRINTABLE HTML
bug 13037647 - PERFORMANCE ISSUE WITH A+ STYLE REPORTS AGAINST ESSBASE
bug 13043745 - PIVOT TABLE'S LAYOUT COLLAPSES WHEN HIDDEN ROW AND TOTALS BEFORE IS USED
bug 13051332 - REMOVE THE SOURCES TYPE FROM THE MDS BI XML SCHEMA
bug 13054445 - REPLACING NULL VALUES WITH '0' IN AN OBIEE 11G PIVOT TABLE IS NOT WORKING
bug 13067020 - PSR:PERF:BIAPPL NEED TO INCREASE MAXCONNECTIONS TO 512 FOR EXALYTICS
bug 13071711 - CIRCULAR JOIN ERROR WHEN RUNNING ANALYSIS USING UPGRADED REPOSITORY
bug 13083074 - PROMPTS CREATING UNSPECIFIED ERROR WHEN SELECTING MULTIPLE CONSTRAINED CRITERIA
bug 13098103 - QA: SELECTION STEPS VIEW: ADVISORY TEXT IS CLIPPED IF NO STEPS IN IN ANALYSIS
bug 13098323 - AN ARITHMETIC OPERATION IS BEING CARRIED OUT ON A NONNUMERIC TYPE
bug 13098545 - EQUALIZERPDS CMD SUCCEEDED BUT COMPARERPD USING THE EQUALIZED RPD FAILED
bug 13107723 - NO RESULTS IS DISPLAYED WHEN CHOOSING THE HIERARCHY AND MEAS WITH METAREAD SEC
bug 13109314 - QA ESSBASE MDX SYNTAX ERR IF SIBLINGSSELECT BASED HIER SELECTION VALUE HIER
bug 13110980 - THE SECTION PROPERTIES OF PIVOT TABLE IS NOT EFFECTIVE OR NOT CORRECT
bug 13146932 - psr:perf:bi obips.searchdropdown.xml to be cached
bug 13147051 - WARNING FILE FROM CONSISTENCY CHECK DO NOT INCLUDE OBJECT TYPE AND OBJECT
bug 13241617 - AFTER APPLY PATCH1156057 INTERNAL ERROR OCCURRED.
bug 13244271 - QA ESSBASE MDX SYNTAX ERROR USING BIQA_ESSBASE INCOME YR AGO MEASURE
bug 13248305 - ACCESS: OGHAG: LABEL NAME SHOULD BE SAME WHEN SEEN IN BI & FORM HELPER TOOLBAR.
bug 13248325 - ACCESS: OGHAG: ERROR SHOULD'NT BE APPEARED FOR 'WEBLOGIC' INPUT ELEMENT.
bug 13248356 - ACCESS:OGHAG: FREQUENCY, START, UNTILL LABELS ARE MISSING IN THE OGHAG FORM HELP
bug 13248403 - ACCESS:OGHAG: ERR NO ALT TEXT SPECIFIED APPEARED IN IMAGE TOOL BAR FOR AGENT SUC
bug 13248457 - ACCESS: OGHAG: AGENT RUNNING IMG SHOULD HAVE ALT TEXT SPECIFIED IN IMAGE TOOLBAR
bug 13249783 - AFTER APPLY PATCH 129725592 OBIEE 11G THROWS BAD XML INSTANCE
bug 13250108 - WARNING WHEN USING NEGATIVE NUMBERS
bug 13326400 - QAVERSION AND COMPANY NAME SHOWN AS NOT MARKED IN ODBC DATA SOURCE ADMIN
bug 13332372 - ESSBASECSDMADROP CUBE DOESNT DROP RPD METADATA PROPERLY
bug 13332593 - PATCHING FAILED WITH ERROR DURING THE XML EXECUTION
bug 13342222 - DELETE AGGR FOR SUBSETS WILL DELETE ALL AGGRS IF SUBSET TABLES ARE MISSING
bug 13345706 - DIM  ASSESSMENT ADMINTOOL CONSISTENCY CHECK ERROR DISPLAYED INTERMITTENTLY
bug 13350175 - ADDING FILTER TO DIFFERENT LEVELS OF A HIERARCHY GETS IGNORED IN MDX
bug 13352005 - ERROR IN QUERIES FOR PROFILE MGMT
bug 13355378 - PROGRESS BAR HANGS FOR THE ADMINTOOL COMMAND UTILITY PATCH COMMAND
bug 13357630 - DO NOT DISPLAY VL ERROR MESSAGES WHILE IMPORT
bug 13360114 - RPDPATCH DECISION FILE NEEDS TO FLAG DELETES THAT CONFLICT
bug 13361656 - REQUIRE ABILITY TO HIDE UNALLOCATED EXTENSIBILITY COLUMNS
bug 13362010 - QA CONFLICT RESOLUTIONS INFORMATION IS MISSING FROM MUD HISTORY
bug 13362302 - CHANGES MADE TO ONLINE BI SERVER USING BISERVERXMLCLI IS NOT UPDATED IN RPD FILE
bug 13363837 - ABILITY TO HIDE COLUMNS
bug 13363970 - ERROR BY THE ORDER TO DROP
bug 13364855 - PROVIDE A HIDE PROPERTY IN COLUMN METADATA
bug 13366363 - CONSISTENCY CHECK REMOVES WHERE CLAUSE OF LTS
bug 13367950 - MISSING ATTRIBUTES XSLT AND XSDSCHEMA FOR PHYSICAL TABLE DEFINITIONIN MDS SCHEMA
bug 13369811 - ESSBASEMSASISANCESTOR RETURNING WRONG RESULTS
bug 13370144 - QAAUTOTTDIMENSIONBASED AGGREGATE RETURN WRONG RESULTS
bug 13371256 - COMPARERPD NEEDS TO ADD ABILITY TO OUTPUT DIFFERENCE FILES IN MDS XML
bug 13372432 - FONT OPTIONS DO NOT WORK CORRECTLY FOR GAUGE VIEWS
bug 13375536 - AUDIT  CATMAN REPORT NOT DISPLAYING COLUMNS
bug 13377581 - DOUBLE BUFFERING DURING AGGR REFRESH DOES NOT WORK
bug 13383217 - QDR ISCUSTOMGROUPUNIQUEID DOES UNNECESSARY STRING CONCATENATION
bug 13387545 - INCREMENTAL PATCH MERGE ERRORS OUT IN 11G ADMIN TOOL WITH MEMORY FAULT ERROR
bug 13390022 - NLSHOT:MISSED MSG FILE ENTIES IN BIFNDN.WPTG
bug 13393226 - INDEXCOL NOT TAKING MINUS CALCULATION WORKS IN 10G BUT NOT IN 11G
bug 13393602 - RSUM NOT CALCULATING CORRECTLY WHEN THERE ARE EXCLUDED COLUMNS
bug 13397739 - ADMINTOOL CRASHES IN QUERY REPOSITORY FILTER DIALOG
bug 13399321 - SESSION VARIABLES HAVING NO VALUE DEFINITIONS ERRORS SHOW UP DURING PATCHING
bug 13399973 - PSRPERFBI OBIS HAS HIGHER MEMORY USAGE IN OBIPS SCALABILITY TEST
bug 13400140 - MULTI-STEP PROMT MISSING THE DASHBOARD PROMPT WHICH LIMIT VALUES BY IS SET
bug 13401386 - AUTO PREVIEW ARE NOT PREVENTED EXCEPT PIVOT VIEW
bug 13403713 - ADMINTOOL CRASHES DURING MUD CHECKOUT
bug 13403816 - AFTER APPLIED MLR 13110245 STILL HAVING THE HIERARCHICAL PROMPT ISSUE
bug 13404181 - VALIDATERPD MIXES OPTIONS 8 AND B
bug 13404203 - INCORRECT SYNTAX TEXT SHOWN FOR UTILITY VALIDATERPD
bug 13405110 - OPENING REPORT CRASHES BI PRESENTATION SERVICES
bug 13405568 - OBIS CRASHES WHEN DEFERRED INIT BLOCK QUERY RETRIEVED NULL VALUE
bug 13408040 - TRANSLATION NOT HAPPENING WHEN DATA FROM INIT BLOCK USED IN REPORT QUERY.
bug 13415219 - BIQA BISERVERXMLEXEC UTILITY GENERATES EMPTY RPD
bug 13415875 - IT IS POSSIBLE TO MODIFY MASTER REPOSITORY PASSWORD IN MUD MODE
bug 13416476 - ADMINTOOL CRASHED DURING PATCHING
bug 13417192 - QAQUERIES ON ESSBASE WORK EVEN WHEN SHARED LOGON SELECTION HAS EMPTY USERPW
bug 13418590 - EXPORT TO EXCEL STILL NOT WORKING PROPERLY AFTER PATCH 12394949
bug 13430638 - XML VALIDATION ERROR INVALID CHARACTER UNICODE ERROR OPENING MDX RPD ASENG
bug 13431540 - MSAS:ISANCESTOR RETURNING WRONG RESULTS
bug 13431823 - QA EVALUATE EXPRESSION CAN NOT BE SHIPPED ERROR AGAINST ORACLE DB
bug 13435342 - MUD DELETE OPTION IS NOT WORKING IN MUD HISTORY IF 0TH VER ALONE IS SELECTED
bug 13436435 - NO MERGE CONFLICT MSG FOR BUSINESS MODEL OBJECT DELETION ON PUBLISH TO NETWORK
bug 13441768 - BI_PLAT  BISERVER QPERSISTTABLE TESTCASES FAILING WITH NQSERROR
bug 13443586 - NEW REPOSITORY SAVED TO DIFFERENT DIRECTORY
bug 13444157 - ERROR WHEN USE IS IN TOP OPERATOR IN FILTER WITH PRESENTATION VARIABLE
bug 13448188 - double column filters does not render correctly for large volume data
bug 13448397 - SUMMARY ADVISOR STATS GENERATION TOOL NEEDS TO HANDLE NONEXISTING USERS
bug 13452077 - QASYBASE ASE AGGREGATE BY QUERY RETURNS WRONG DATA
bug 13452992 - OPTION LINK TO SOURCE CONTOL FILES ALLOWS TO CHOOSE ANY XML FILE DISABLED AFTER
bug 13455207 - BIQAAUTOSYBASEBISERVER GENERATING WRONG PHYSCIAL QUERY FOR SYBASE
bug 13457788 - PAINT.RPD AND DATA FILES NEEDS TO BE REMOVED FROM THE INSTALLATION
bug 13458667 - HIDDEN OPTION NOT AVAILABLE FOR DATE COLUMNS IN TABLE LAYOUT
bug 13463013 - BIQABLKHOTYBASEBISAMPEDISTINCT USED IN OUTER  SUB SELECT IS NOT SUPPORTED
bug 13464450 - QA: SERVER NAVIGATION ERROR WHEN ONLY CONFIGURED TT INSTANCE IS DOWN
bug 13469803 - EXTERNALIZATION TEST IS FAILING
bug 13470220 - OBIEE 11.1.1.5  REMAINING ERRORS AFTER APPLYING PATCH 12587722
bug 13477225 - AGGREGATE INCORRECTLY USED TO SATISFY QUERIES CONTAINING NONADDITIVE MEASURES
bug 13477267 - PM RENAME VIEW NOT WORKING IN CURRENT BUILD.
bug 13481225 - ALLOW USER TO CORRECT PASSWORD WHEN OPENING MDS XML REPOSITORY
bug 13484370 - STRESS:BI:BIS SOCKET COMMCN ERROR AT CALL=RECV:NUMBER=104 CONXN RESET PEER
bug 13489648 - PSR:PERF:BIAPPL CLONING LARGE TABLE FROM TT INTO ORACLE IS VERY SLOW
bug 13492592 - pm: need right click separator line on column options before keep only
bug 13493730 - NLS: ACTION LINK TEXT NOT LOCALIZED ON DASHBOARD PAGE
bug 13497916 - INCORRECT SUMMARY STATISTICS GENERATED FROM USAGE TRACKING TABLE
bug 13498415 - MUTITHREAD ONLINE CHECKIN BROKEN
bug 13499368 - PATCHRPD: INITIALIZATION OF RPSTRUCT MAYBE MISSED
bug 13499619 - CANNOT VIEW DATA FROM TIMESTEN ON UPGRADED RUP2 INSTANCE
bug 13501903 - PATCH FOR BUG 11837656 DOES NOT FIX THE ISSUE WITH DOUBLE QUOTES
bug 13502703 - ATTR SELECTIONS ON HIERARCHY COLS SHOULD ALLOW PROMPTING ON COMPARE COL.
bug 13503455 - EQUALIZEDRPDS.EXE CRASHES  SEEMS TO BE RELATED TO UPGRADE ID
bug 13504055 - DELETE SUBSET FOR TWO FACTS SHARING A DIMENSION CRASHES
bug 13506958 - SUMMARY ADVISOR SAMPLING PERFORMANCE REGRESSION WHEN GRAND TOTAL LEVEL IS USED
bug 13510213 - FORWARD PORT OF BUG 13412620 TO 11G MAIN
bug 13510889 - RUP2 RPD PATCH DIFS
bug 13511501 - WHEN MULTI-VALUE SESSION VARIABLE IS USED IN FILTER OBIEE SENDS WRONG VALUES
bug 13511930 - NEW COLUMN CREATED BASED ON TWO DIFFERENT DIMENSIONS RETURNS INCORRECT RESUTLS
bug 13514815 - QA:RC2:AGGR PERSISTENCE FAILED WHEN DIM SHARED IN TWO SCHEMAS UNDER THE SAME DB
bug 13516292 - REPOSITORY INIT BLOCKS LOSE CONNECTION TO DATABASE AND NEVER REGAIN
bug 13516397 - ESSBASE:CS:DMA:ADMINTOOL HANGS WHEN SUBJECT AREA WITH LOOKUP TABLES IS SELECTED
bug 13517767 - POSITIONAL CALC CAN CAUSE XMLWRITER EMPTY DOCUMENT ERROR
bug 13517856 - IPAD PAGE BEHAVIOR IS NOT THE SAME AS SEEN IN THE BROWSER Yulon Motor
bug 13522060 - RPD SESSION VARIABLE UNABLE TO IDENTIFY THE DYNAMIC SCHEMA NAMES FOR OLAP
bug 13523548 - ERROR OUT WHEN USING MULTIPLE DOUBLE COLUMNS IN SAVED FILTERS
bug 13526249 - SUMMARY ADVISOR DOES NOT CONSUME OLD-STYLE FILE CACHE ENTRIES
bug 13526632 - DTE ESSBASE CANNOT CONNECT TO BI
bug 13528473 - BI COMPOSER ANALYSIS CREATED USING COMBINE UNION IS NOT EDITABLE IN BI COMPOSER
bug 13528802 - EXALYTICS:AGGREGATES: REQUIRE A MODE TO DELETE PARTIAL DIMENSION AGGREGATES
bug 13529697 - PORT OF 8711111 ON TOP OF 11.1.1.7.0
bug 13531868 - EXALYTICS:AGGREGATES: SCRIPT FAILS AT THE 1ST FAILURE OF AGGREGATES
bug 13531910 - EXALYTICS:SUMMARY ADVISOR: FAILS AT THE 1ST PROBLEM
bug 13532075 - EDITING REPORT NOT REFLECTED IN DASHBOARD
bug 13533404 - SECTIONS HEADERS ARE CAUSING DASHBOARD SPACING ISSUES
bug 13535937 - NEGATIVE VALUE IN CACHE MANAGER
bug 13542500 - CONSISTENCY CHECK DOESNT FIX MULTIPLE LEVEL TO LEVEL LINKS
bug 13542805 - BAD CACHE ENTRY BEING GENERATED
bug 13545969 - MERGE  VECTOR  LOGICALCOLUMNLEVEL_VECTOR UNIT TEST IS FAILING
bug 13546009 - SELECT PIVOT TABLE IN VIEW SELECTOR CAUSES COLUMN TO BE EXCLUDED WHEN DRILLING
bug 13546383 - COMPARERPD STD OUTPUT MESSAGE LINES MISSING LINE FEED
bug 13553428 - DELIVER TO CORP OID LDAP USERS FAILED WITH IMPERSONATOR DOES'NT EXIST
bug 13554805 - ERROR MESSAGE NEEDS TO BE MORE HELPFUL WHEN TRYING TO IMPORT METADATA
bug 13555089 - 2 MERGE VAR BLOCK GROUP TESTS ARE FAILING
bug 13560202 - EXTRACTPROJECT.EXE CRASHES DURING THE PATCHING PROCESS
bug 13560216 - ENABLE PUBLIC SQL GRAMMAR CHECK IN API TEST
bug 13561559 - RUP2-ST2-CDRM  SECTION FORMATTING IS SKIPPED WHEN APPLY PROMPT OR CLICK REFRESH
bug 13562847 - PG/PROMPTS DROPDOWN LISTS ONLY GROUP MEMBERS AFTER PICK GRP FROM DROPDOWN
bug 13563800 - INCLUCDE SELECTED MEMBER NOT WORKING FOR LEAVES OF IN VALUE HIERARCHY
bug 13564003 - SAVING AN IBOT(AGENT) GIVES ORACLE BI SCHEDULER ERROR [NQSERROR 76016]
bug 13565634 - LAYOUT TABLE NEEDS TO EXPLICITLY MARKED ROLE=PRESENTATION ON DASHBOARD
bug 13566162 - OTBI CASCADING B/W TWO PROMPT SETS IS NOT HAPPENING IN PS5RC2(11.1.1.6.0)
bug 13567100 - CASE WHEN USED IN MEASURE IN PIVOT IS NOT WORKING AS IN 10G
bug 13567594 - SDE_FUSION_NATURALACCOUNTDIMENSION MAPPING FAILS IN RUP2 ETL
bug 13568305 - OBJECT PROPERTY DIALOG AND UDML CODE SHOW DIFFERENT NAMES IN COMPARE DIALOG
bug 13568377 - QA:INT COMPARISON OPERATOR FOR ATTRIB SEL NO DISPLAY OK IN SELECTION STEPS VIEW
bug 13568537 - TWO STRUCTURES CUBE AND MULTIPLE LITERAL SUPPORT IN ISCHILD FUNCTION
bug 13568567 - PROJECT EXTRACT FAILS TO EXTRACT CERTAIN PROJECTS DURING PATCHING
bug 13568728 - ADMINTOOL HANGS WHEN VIEWING OBJECTS PROPERTY IN COMPARE DIALOG
bug 13570406 - OBI 11G MAP VIEW DOESN'T DISPLAY THE CORRESPONDING LEVEL DATA AFTER DRILL DOWN
bug 13570455 - NLS:LNX:SOME BIPS ERR MSG NOT HONOR USER PREFERENCE FOR ZHCN/ZHTW/PTBR
bug 13571493 - BI COMPOSER SAW SERVER CRASHES AFTER SELECTING TABLE TYPES MORE THAN TWO TIMES
bug 13573558 - AUDIT  CASE SENSITIVE CHECK AGAINST RPD
bug 13573564 - AUDIT  WRONG SUBJECT AREA WHEN WEBCAT IS LARGE
bug 13574731 - QM CRMQA_RRF - DASHBOARD CONTENT
bug 13578723 - BI COMPOSER TO SHOW/HIDE COLUMNS BASED ON NEW HIDDEN COLUMN ATTRIBUTE
bug 13578809 - REQUIRE A FRAMEWORK TO DETECT PROBLEMATIC MODELS FOR AGGRPERSIST & SUMMADV
bug 13578840 - FUSIONBI: BI SERVER INITBLOCKS WITH UNIONS DONT BYPASS DIRECT DB ACCESS
bug 13578848 - AUDIT  UNABLE TO REPORT ON SQL IN NON-ANALYSIS
bug 13581658 - BIAPPS RUP2 FORCE WEBCAT UPGRADE
bug 13582384 - RUP2 HCM CREDENTIALACCESSPERMISSION IN BI STARTUP LOGS AFTER PATCHING
bug 13583449 - SETTING WINDOW SIZE AND START RECORD RESULTS IN NO RECORDS (EXISTING PRODUCT)
bug 13583718 - SERVER CRASH DURING INTERNAL FULL OUTER STITCH JOIN ON COLUMNS WITH NUMERIC TYPE
bug 13585071 - RUP2::SOL X64: NQUDMLEXEC FAILS WITH SYNTAX ERROR
bug 13586650 - QA PSBH1  CRASH DISPLAY SELECTION STEPS VIEW EXCEPTION CONDITION DBLE COL QDR
bug 13586994 - PSBH1: PM-SIBLINGS OF ON VALUE HIERARCHY REMOVE INCORRECTLY RETURNS NO DATA.
bug 13587288 - PSBH1: PM NEED TO WRAP SELECTION VIEW TXT SO DON'T SCROLL WINDOW.
bug 13587785 - ESSBASE:DMA:UI: CUBE DEPLOYMENT FOR DATAMART AUTOMATION FAILED
bug 13590658 - QA: PSBH1: UI ISSUE - ADD/REMOVE SA TAB KEEPS GETTING BIGGER AS I SELECT/UNSELEC
bug 13590974 - qa: psbh1: difficult to format hier levels since names not listed
bug 13591344 - ADMINSERVICE.EAR CONTAINS A META-INF/JAZN-DATA.XML FILE.
bug 13592629 - CANNOT RECREATE THE SAME CURRENT RPD FROM BISERVERXMLEXEC.EXE
bug 13596457 - PATCHRPD IS NOT CORRECTLY UPDATING PROJECTS WHEN SUBSET PATCHING IS BEING USED
bug 13596792 - PATCHRPD UNABLE TO HANDLE DELETED COMPLEX JOIN
bug 13597266 - BIDOMAIN ADMINSERVICE GPA GETS WIPED OUT AFTER BOUNCE
bug 13605099 - BI EXTENDER AUTOMATION JAR AVAILABILITY FOR FUSIONAPPS
bug 13605626 - RPD COMPARISONS SHOWS ASSERTIONS
bug 13605692 - CONSISTENCY CHECK IS CHECKING HIDDEN OBJECTS
bug 13606175 - PLAN CACHE REGRESSION FOR SELECT_PHYSICAL
bug 13609801 - DASHBOARD PROMPTS NOT RETURNING CHOICE VALUES
bug 13614338 - SERVER CRASHED WHEN SETTING HIDDEN PROPERTY FOR FOLDER VIA ADMINTOOL
bug 13615548 - UNKNOWN TYPE OF  LOGICAL COLNMNS WHEN NUMERIC IS USED 787635
bug 13616593 - AUTO PREVIEW ARE NOT PREVENTED FOR GRAPH
bug 13623096 - AFTER APPLYING PATCH:13428026 THE SEGMENTATION FAULT IS HAPPENED.
bug 13625435 - RUP2-ST-CDRM FORMMATING AND ACTION LINK ISSUE AFTER PS5 UPGRADE
bug 13626098 - RUP2-ST-CDRM  DRILL DOWN REPORT NOT RETURNING OUTPUT
bug 13626491 - REPORTS ARE FAILING AFTER APPLYING PATCH13470147 WARNINGS IN CONSISTENCY CHECK
bug 13627864 - 13794469:RUP3:PS5 RC4 PATCH 2 COMPATIBILITY - BACKPORT OF BUG 13597266 IN 11.1.1.6.1
bug 13628171 - CONSISTENCY CHECK DOESNT FIX MISSING LTS FOLDERS
bug 13628713 - SECTION COLLAPSE GRAPHIC IS A BIT TOO SMALL FOR IPAD TOUCH INTERACTION
bug 13629289 - QA: LAYOUT: CAN NOT MOVE BASE FACTS MEMBER IN FUNNEL MEASURES SECTION
bug 13629380 - HIERARCHICAL COLUMN EXPAND GRAPHIC IN TABLE/PIVOT TOO SMALL IN MOBILE CONTEXT
bug 13629398 - TABLE/PIVOT PAGING BUTTONS TOO SMALL AND CLOSE IN MOBILE CONTEXT
bug 13629467 - ACTION LINK MENU NOT USING IPAD STYLE
bug 13630074 - RUNNING ESTIMATE LEVELS CRASHES ADMIN TOOL
bug 13631676 - OBIEE 11G  BISERVER ASSERTION ERROR AFTER APPLYING 13562882 PATCH
bug 13631863 - ie jserror: 'obips.history' is null or not an object
bug 13632035 - LOGICAL TABLE SOURCE NOT DESCRIBED IN XML REPOSITORY DOCUMENTATION
bug 13634568 - WIN64  WEBCAT APPLY PATCH FAILED  CATMAN INVALID CHARACTERS IN PATH
bug 13635238 - SASEEDQUERY FUNCTION CAUSES NQSERROR: 26002 FOR LONG QUERIES
bug 13636501 - MATS TESTWEBCATALOG DUMMYCATALOG.DIF
bug 13639701 - NULL DATA RETURN FROM CACHE
bug 13640427 - RUP2-AIX BI CONVERSION FROM XML TO RPD FAILS WITH PASSWORDS DIFFERENT
bug 13640792 - CONSISTENCY CHECK DOESNT FIX UNKNOWN LOGICAL COLUMN TYPE
bug 13641669 - EMPTY DASHBOARD PAGE WHEN USER HAS FULL ACCESS
bug 13642547 - AGG RULE ORDER CHANGED AFTER REPOSITORY REGENERATION
bug 13642995 - BISERVERXMLEXEC CRASHES WHILE REGENERATING PS1 RPD
bug 13645029 - OBIEE 11.1.1.5.0 PRODUCES MALFORMED MDX WHEN DATA SECURITY FILTERS ARE APPLIED
bug 13646082 - CUST: WHEN INTRODUCING A COLUMN SELECTOR, YOU CANNOT USE CONDITIONAL FORMATTING
bug 13646323 - ERROR IN USING EVALUATE_PREDICATE WITH SUPRESSMISSING FOR HFMADM DATASOURCE
bug 13647053 - BI SERVER PERIODIC FAILS
bug 13647309 - OBIEE GRAND TOTAL FUNCTIONALITY INCORRECT AND INCONSISTENT WITH OLAP CUBES
bug 13648313 - DRILL DOWN ON OBIEE PAGE  INTERESTED PARTIES NOT WORKING FOR EA&R PRODUCT
bug 13649502 - RUP2-ST1CDRM DRILL DOWN REPORT NOT RETURNING OUTPUT - STAYING BUSY
bug 13651281 - RUP2 : COMPARE RPD IS SHOWING FALSE POSITIVES FOR LTS UPDATES
bug 13651472 - ACCESS: OGHAG: ERROR SHOULD'NT BE APPEARED FOR 'ANALYSIS' INPUT ELEMENT.
bug 13651508 - ACCESS: OGHAG: MISSING LABELS IN THE DELIVERY CONTENT TAB WITHIN THE AGENT.
bug 13651525 - CONSTRAINT SEARCH ALONG WITH A SAVED FILTER CAUSES ERROR
bug 13651529 - ACCESS:OGHAG:CONDITION OBJECT WAS'NT APPEARED IN THE BROWSE DIALOG OF THE AGENT.
bug 13652324 - SAP BW: ADD GETMEMBERS/KEYDATE/HIERARCHY NODE/HIERARCHY VARIABLE SUPPORT
bug 13653984 - QA:ACCESS:TAB AND ENTER OF SELECT ANALYSIS THEN CONTROL GOES OUTSIDE THE DIALOG.
bug 13654029 - QA:ACCESS:JAWS:BLK:ACTIONS/AGENTS ARE NOT SHOWN UP IN BI HOME PAGE WHEN ACCESSIB
bug 13657461 - QA:IPAD:FULL SCREEN MODE CHANGES TO NORMAL MODE WHILE DRILLING
bug 13680310 - ERROR DISPLAYING VIEW WITH NESTED AND SAVED CALC ITEMS
bug 13680754 - SAVE CURRENT CUSTOMIZATION IS NOT GETTING APPLIED ON NEXT 25 ROWS
bug 13681443 - PRESENTATION FOLDERING UPGRADE ISSUES
bug 13682411 - CALC ITEM NOT DISPLAYED IN A PIVOT TABLE AFTER PATCH 13544352
bug 13683564 - TABLE PROMPT NOT WORKING WHEN SOURCED FROM COLUMN BINS
bug 13685763 - NQSERROR59001 OCCURS WHEN USING SUBSTRING POSITION AND LENGTH AT SAME TIME
bug 13686830 - ACCESS:OGHAG: ERROR SHOULD'NT BE APPEARED FOR RECIPIENTS->'ALL' INPUT ELEMENT.
bug 13687410 - QA:ACCESS:ALT TEXT MISSING FOR THE OBJECTS IN THE RECIPIENTS TAB OF AGENT.
bug 13689551 - QA: ERROR AFTER INITIAL REMOVE GRAPH FROM 1ST POSITION IN VIEW SELECTOR
bug 13690720 - NEWF: ADMINTOOL CRASHED WHILE OPENING MDS XML
bug 13692889 - RPD VALIDATION SCRIPT NEEDS TO BE INSTALLED INTO THE ORACLE HOME
bug 13693098 - QA:ACCESS:OGHAG:LABELS ARE MISSING FOR ALL THE FIELDS OF ACTION DAILOGS
bug 13694319 - QA: FATAL ERROR OCCURS WHEN THE FONT SIZE IS A LARGER NUMBER
bug 13694724 - OKING LOGICAL COLUMN DIALOG CLOSES LOGICAL VIEW TREE
bug 13700149 - NLS:T13YCT:SOME MISSPELLED STRINGS IN THE ADMINTOOL
bug 13703227 - QA: SELECTION: SHOWS VOID(NULL) LINK WHEN CLICKED ON VIEW GROUP IN EXCEL
bug 13704274 - SECURITY FILTERS ARE INCORRECTLY APPLIED TO LEVEL-BASED MEASURES
bug 13707164 - NPE IN CATALOGTAGHANDLER.REMOVEJUNKFROMXML
bug 13708781 - ORACLE OLAP PARENTCHILD QUERY PERFORMANCE ISSUE  LIMIT TO BOTTOMDESCENDANTS
bug 13709093 - renaming a dashboard folder w preserving references to old name causes duplicate
bug 13710970 - BISERVERXMLEXEC CRASHES DUE TO BROKEN NQSTRINGS C_STR METHOD
bug 13713970 - MATS: MATS_BI_DEV_P2 - TRELLISVIEWINTERACTIVITYINNERDRILLINGTEST_TESTDRILLINGLIN
bug 13714322 - USE BETTER ERR MSG WHEN A PHYSICAL AGGR TABLE ALREADY EXISTS DURING CREATE AGGR
bug 13714407 - FORCE UPGRADE OF DEFAULT FORMAT METADATA OBJECT HAS ERROR
bug 13717843 - QA:ACCESS:OGHAG:LABELS ARE MISSING FOR OPTIONS DAILOG FOR ACTIONS USING OGHAG TO
bug 13717878 - NLS:INTEROP:NUMBER FORMAT IN CHART XY-AXES LABEL DOESN'T HONOR FUSION USER PREFS
bug 13719583 - CONSISTENCY CHECK ERROR 38028 SHOULD BE MADE WARNING
bug 13721910 - BI COMPOSER GRAPH TYPE SCATTER COMES UP WITH X-AXIS IN PLACE OF Y-AXIS
bug 13722009 - UPDATE COPYRIGHT DATE WITHIN JAVADOCS FOR JMX API
bug 13722110 - QA:ACCESS:LABEL MISSING FOR AN IBOT FORM TAB.
bug 13723619 - TEMPACTIONPATH VALIDATION ERRORS IN DEFAULT FORMATUPGRADE
bug 13723775 - RECIEVING ERROR WHEN ADDING FIELD INTO ANALYSIS AFTER ADDING CUSTOM CLASSES TO T
bug 13724814 - ADD ABILITY TO RETRIEVE QUERY METADATA ON ISSUE RAW SQL SCREEN
bug 13724995 - CONSISTENCY CHECK CRASHES ON PS1 RPD
bug 13725258 - FIX REGRESSION IN ESSBASE WRITEBACK
bug 13726065 - OBISDIAGNOSTICS PROCEDURE CALL GIVING OUTPUT WITH WRONG PARAMETER
bug 13726711 - FIX WARNINGS ABOUT NEW OPERATOR USAGE IN CALCSCRIPT
bug 13726994 - QA:ACCESS: LABELS MISSING FOR CONDITIONS WHEN FORM TAB IS CLICKED.
bug 13727141 - QA:ACCESS: LABELS MISSING IN SCHEDULE TAB FOR AGENTS WHEN FORM TAB IS CLICKED.
bug 13727226 - QA:ACCESS: LABELS MISSING IN 'DELIVERY CONTENT' FOR AGENTS CLICKING FORM TAB.
bug 13727310 - QA:ACCESS: LABELS MISSING IN 'RECIPIENT' TAB FOR AGENTS CLICKING FORM TAB.
bug 13729675 - METADATA SERVICE - NESTED TABLES IN DEPTH FIRST ORDERING
bug 13729891 - NLS:CHART TITLE NOT TRANSLATED IN PDF/PPT OUTPUT
bug 13730809 - QA:ACCESS:OGHAG:ALL ACTION TYPES LABELS ARE MISSING IN AGENT AS PER OGHAG STAND
bug 13730897 - QA:ACCESS:UNABLE TO EXPAND 'OVERVIEW' USING KEY.
bug 13731138 - QA:ACCESS:WRONG CAPTION FOR EXPAND IMAGE FOR 'OVERVIEW' LABEL IN AGENTS.
bug 13731893 - QA:ACCESS:OGHAG:ACTION ICONS TEXT IS MISSING IN AGENT AS PER OGHAG STANDARDS.
bug 13732232 - QA:ACCESS:LABELS MISSING IN OGAGH-'FORM' WHILE CREATING CONDITION BASED ON KPI.
bug 13732369 - QA:CLICKING ON 'KPI IMAGE' LAUNCHES TWO WINDOWS WHILE CREATING CONDITION.
bug 13733399 - ESSBASE:CS:WB: INTERNAL ERROR WITH UPDATE STATEMENT WHEN CACHE IS ENABLED
bug 13733427 - ADD AND UPDATE VERSION STRING TO DIFF FILE
bug 13734949 - QA:ACCESS: LABELS MISSING IN 'SELECT RECIPIENT' FOR AGENTS CLICKING OGHAG-FORM
bug 13735598 - CLIENT INSTALLER DOES NOT INCLUDE EXTENDER NEW FEATURES
bug 13735657 - ESSBASE:CS:WB:WRITEBACK QUERIES USE PHYSICAL CUBES COLUMNS NOT EXTERNAL NAMES
bug 13737150 - UNABLE TO VIEW LOG FILE FROM ADMINISTRATION > MANAGE SESSIONS
bug 13738126 - NEWF DYNAMIC PRESENTATION FOLDERING NOT HAPPENING THROUGH ANSWERS
bug 13739082 - ASSERTION ERROR IF VALUE HIER WITH CALC ITEM MOVE TO PAGE/PROMPTS EDGE
bug 13739632 - QA:BLK:RGRN:ODBC ERR WHEN YOU ADD KPI TO KPI WATCH LIST & WHEN USED SHARED LOGON
bug 13740269 - ESSBASE:DMA:UI: CUBE DEPLOYMENT FOR DATAMART FAILED WITH ESSBASE ERROR(1007083)
bug 13740577 - PSR:PERF:BIAPPL OBIS CRASHED AT RENDERABLELITERALFUNCTION()
bug 13742063 - QA:LABELS MISSING IN OGHAG-FORM IN CREATING CONDITION BASED ON IS-PROMTED ANALY
bug 13742288 - QA:LABELS MISSING IN OGHAG-FORM IN CREATING ACTION BASED ON CONDITION.
bug 13742385 - QA:ERROR MESSAGE IN OGHAG-'STRUCTURE' WHILE CREATING CONDITION BASED ON KPI.
bug 13742461 - QA:LABELS MISSING IN OGHAG-FORM IN SELECT USER WHILE CREATING AGENT.
bug 13742727 - NEWF PRESENTATION DYNAMIC HIDING IS NOT WORKING FOR PRESENTATIONS HIERARCHIES
bug 13743698 - DISABLE REDO LOGGING FOR TT TARGETS
bug 13744021 - PARALLELIZE TT INDEX CREATION
bug 13767664 - UPGRADE SHOULD ONLY FORCE IF SET EXPLICITLY
bug 13768528 - QA:ACCESS:OGHAG:SAVE ACTION DAILOG IS MISSING THE LABEL AS PER OGHAG STANDARDS.
bug 13768979 - QA:ACCESS:OGHAG:ALL ACTIONS PARAMETER FIELDS ARE MISSING THE LABELS AS PER OGHA
bug 13769021 - QA:ACCESS:OGHAG:???SELECT SCRIPT FUNCTION??? DIALOG FIELDS ARE MISSING THE LABELS AS
bug 13770086 - 13794469:RUP3:PS5 RC4 PATCH 2 COMPATIBILITY - BACKPORT OF BUG 13605099 IN 11.1.1.6.2
bug 13770155 - 13794469:RUP3:PS5 RC4 PATCH 2 COMPATIBILITY - BACKPORT OF BUG 13628171 IN 11.1.1.6.2
bug 13770213 - SERVER DIAGNOSTICS PROCEDURES TO BE RESTRICTED TO ADMIN USERS
bug 13772542 - OTBI-IC:EARNINGS AND ATTAINMENT GRAPHS ARE NOT SHOWING UP IN SALESCOMP BI
bug 13774538 - GRAPH TITLE DISPLAYING VARIABLE CODE {TESTCASE} ON EXPORTED TO PDF FILE
bug 13775119 - ESSBASE:CS:WB:UNKNOWN MEMBER ERROR WHEN MEASURE NAMES HAVE SPACE
bug 13775171 - QA FIREFOX BROWSER REFRESH IN COMPOUND VIEW EDITOR SHOWS ERROR
bug 13775707 - FIX OBIMFSCMUTIL.CPP MEMORY LEAK
bug 13776096 - ENABLE FIRST/LAST FOR TIMESTEN V11.2.2
bug 13776248 - FIX WARNINGS ABOUT NEW OPERATOR USAGE IN SUMMADV STATS WRITERS
bug 13776261 - ESSBASE:CS:WB: NO PERMISSION ERROR FOR NON-WRITABLE LOGICAL COLUMN
bug 13777036 - RUP3:WEBCATDIFFDEPLOYER FAILS WITH PATH NOT FOUND ISSUE
bug 13777152 - DEMO SERVICES - RECONCILIATION REPORT ERRORS OUT USING THE PRESENTATION VARIABLE
bug 13778181 - QA NEWF ADMINTOOL CLOSE DOWN AFTER SELECTING MULITPLE ESSBASE CUBES FOR IMPORT
bug 13778877 - UNABLE TO MOVE MEASURE COLUMNS AFTER FORMATING THE HEADER
bug 13779673 - DASHBOARD UPGRADEXML RETURNED 'FALSE' WHEN A CHANGE IN THE XML OCCURRED
bug 13780631 - FIX COMBINED RESULTS LINK FOR LISTS FROM DIFFERENT SUBJECT AREAS
bug 13780638 - BAPI GETMEMBERS DOESN'T SUPPOORT LIST PARAMETER OF ISCHILDREN
bug 13781010 - USE OPTIMAL TYPES FOR TIMESTEN
bug 13781876 - ESSBASE:CS:WB:NQSGETESSBASECUBEINFO DOESN'T EVALUATE SESSION VARIABLE
bug 13782916 - NLS:ZH-TW:TRUNCATE STRING FOR ESSBASE DMA WIZARD STEP 2
bug 13785119 - ESSBASE:CS:WB: HYPERION VERSION 11 IS NOT SUPPORTED FOR WRITE-BACK
bug 13785339 - QA HOT IE PANEL DIV ERROR POPS UP WHEN THE GRAPH IS SAVED
bug 13785360 - DSS INFUSION (STARTER) BI SAVED CUSTOMIZATIONS NOT CARRIED OVER TO FUSION APP
bug 13786129 - REVERT TO UNCOMPRESSED COLUMNS IN TT
bug 13786426 - RFI BACKPORT OF BUG 13786426 FOR INCLUSION IN 11.1.1.6.2BP1
bug 13788533 - NLS:SINGLE QUOTE CHAR SHOW AS TWO FOR LOCALIZED METADATA NAMES IN RPD
bug 13788534 - PSR:PERF:BIAPPL MEMORY LEAKS & HIGH OBIPS MEMORY USAGE WITH TRELLIS
bug 13788536 - CUST: GRAPH PIVOTED RESULTS PREVENTS ADDING NEW COLUMNS TO CRITERIA
bug 13790251 - LOWER LEVEL LTS IS PICKED IN A QUERY ON PS5RC4 RELEASE INSTEAD OF HIGHER LEVEL
bug 13790590 - ADMIN SERVICE PATCHES DO NOT GET DEPLOYED BECAUSE NOSTAGE MISSING FROM CONFIG
bug 13790594 - FIX UP TRELLIS COMMENTED TESTS IN TRELLISVIEWEDITORTEST TO AVOID REGRESSIONS
bug 13790972 - TRELLIS LIMIT COL EDGE BY SECTION/PAGE VALUE AS A DEFAULT (SAME AS ROW IS NOW)
bug 13792237 - ADMINTOOL CRASHES WHEN DELETING MULTIPLE PHYSICAL TABLES
bug 13794350 - PIVOT TABLE CALCULATED ITEMS GRAND TOTAL IS NOT CORRECT
bug 13795240 - LOOKUP OF BI SERVER CONFIG MAY CAUSE THREAD STARVATION (STRESS ISSUE)
bug 13796493 - REG: SCROLLING TO NEXT RECORD WITH TOTALS RESULTS IN SOME INVALID START SLICES
bug 13797890 - WPTG_TBT:FMW:CNTXT:Q&A200741 -1:DELETE AGGREGATES SHOULD BE REWRITTEN TO CAPS
bug 13798288 - ADF EXTENDER - NOT APPLICABLE VALUE BASED TREE MAPPINGS AND PRESENTATION CHANGES
bug 13798369 - QA:'INVOKE AN HTTP REQUEST' ACTION DIALOG UI CHANGED IN LATEST BUILDS.
bug 13798590 - OTBI:BI EXTENDER:DFF_VO MAPPED TO MULTIPLE BASE_VOS MISSING FROM LTS.
bug 13800225 - BI SERVER DSN CONFIG: REQUEST TO CHECK IN UPDATED .CHM (HELP) FILE
bug 13804749 - MAP VIEW FORMAT OUTLINES SHOULD BE RELATED TO FILL COLOR
bug 13805516 - SUPPORT FOR IPAD CLIENT TO IDENTIFY ITSELF AS OLD CLIENT TO 6.0 AND 6.1 SERVER
bug 13805685 - STRESS:FA:PRJ STUCK THREADS DURING SCHEDULING REPORTS USING WEB SERVICES API
bug 13806092 - WEB CATALOG UPGRADE FAILED
bug 13808439 - ACCESS:TAB  NOT CYCLING FOCUS WITHIN 'CHOOSE MEMBER' POPUP DIALOG
bug 13811498 - UPDATE MARKETING ONLINE HELP FILES
bug 13811755 - ERROR: CANNOT FUNCTION SHIP FOLLOWING EXPRESSION IN 11.1.1.6
bug 13813984 - PSR:FUNC:BI: OBIS CRASHES WHILE RUNNING WRITEBACK SCENARIO
bug 13815455 - EAP ALOCA SCALED OUT NOT WORKING.
bug 13815788 - INCREASE PRECISION OF SURROGATE KEY DEFAULT TYPE TO 4 BYTES
bug 13816056 - RUP2ST3: GETPROMPTEDCOLUMNS GAVE EMPTY RESULT FOR SUSPECT SYNC SEGMENT
bug 13819564 - QA:ACCESS:OGHAG:SELECT EXISTING ACTION DAILOG IS MISSING THE LABEL IN AGENT AS P
bug 13821966 - MY DASHBOARD IS NOT DISPLAYED IN DASHBOARD LIST
bug 13824483 - BI COMPOSER PREVIEW OF TABLE LAYOUT PROMPT FOR IS DIFFERENT IN BI COMPOSER
bug 13826720 - PSR:PERF:BIAPPL NEED QUERY GOVERNOR FOR TRELLIS TO LIMIT NUMBER OF CHARTS
bug 13826776 - ESSBASE:CS:AGGP - QA: AGGR PERSISTENCE ESSBASE FAILED DURING METADATA CREATION
bug 13826958 - BACKPORT BUG 13826958 TO 11.1.1.6.2
bug 13829847 - QA:SHOWINFOPANEL ERROR ON MOUSE HOVERING THE LINE FORMAT ON MAP VIEW
bug 13831480 - FUSIONBI: EXISTING PHYSICAL JOINS REMOVED WHEN IMPORTING DFF VO
bug 13833240 - PSR:PERF:BI:OBIS CRASHES WHEN SMA IS DISABLED
bug 13836007 - DISCRETE BUCKETING FOR VARIABLE SHAPES LACKS DESIRED GRANULARITY
bug 13836115 - TAGSBLK MATS BI_DEV_P2 6 DIFFS
bug 13836660 - QA: IPAD :TOOLTIP CHANGES POSITION WHEN HIERARCHICAL COLUMN EXPANDS
bug 13839394 - QA NEWF ADMINTOOL CLOSES WHEN RIGHT CLICKED ON PHYSICAL DIMENSION
bug 13840051 - BI EXTENDER: DFF MAPPING IN PRESENTATION LAYER
bug 13848284 - double column (descriptor id) dashboard prompt - enable sql results on code colu
bug 13851128 - NEED EXALYTICS ACCELERATION FLAG WRITTEN OUT INTO OBIPS' BRIDGECONFIG.PROPERTIES
bug 13851184 - QA: CUSTOM CRITERIA MEASURE NUMBER FORMAT OF NULL DISPLAYS TRELLIS SCALE WITH #0
bug 13851656 - MAPPINGS FOR SMALLUINT AND UINT TO TT TYPES NEED CORRECTION
bug 13852263 - ACTION LINKS - NAVIGATION TO BI REPORTS DOESN'T WORK ( OPEN IN NEW WINDOW)
bug 13852705 - OBIEE 11.1.1.6 - COLUMNS ORDER AFFECT RESULTS IN ERROR
bug 13852931 - INTEGRATIONS WITH MS ACCESS TO BI SERVER FAILS THROUGH ODBC
bug 13855953 - ASSERTION FAILURE:SLICE<M_SLICES.SIZE ON MOVING A PARTICULAR COLUMN TO ROWS
bug 13860089 - Admintool crashes while doing consistency check
bug 13861745 - MAP DRILL LINKS DO NOT RESPECT DO NOT DISPLAY POPUP SETTING
bug 13862277 - GRAPHING ENGINE ERROR - WHILE DISPLAYING LINE-BAR COMBO CHART
bug 13862474 - QA: RIGHT-CLICK ON MEASURE DATA VALUE>INCLUDE COLUMN FOR NON-MEASURE COL, ERROR
bug 13862882 - ESSBASE AGGR PERSIST IS CREATING BSO APPLICATIONS
bug 13863190 - BI CONTENT SUPPORT FOR MOBILE WEB-BROWSER USER-AGENTS
bug 13863952 - BI SERVER CRASHES WHEN USAGE TRACKING OR SUMMARY STATS LOGGING IS TURNED ON
bug 13865893 - VALIDATERPD MIXES OPTIONS -S AND -B
bug 13866849 - ESSBASE:CS:WB: MATS FAIL WITH UNKNOWN MEMBER ERROR
bug 13867863 - DISABLING DMA WIZARD IN 11.1.1.6.2
bug 13868870 - BACKPORT OF 13837505 ON TOP OF 11.1.1.6.2
bug 13872698 - MEMORY CORRUPTION IN CRITERIACOLUMNIMPL.CPP
bug 13873013 - PSR:PERF:BIAPPL: CREATE AGGRS NOT PARALLELIZED TARGETING TIMESTEN
bug 13873158 - NO VERTICAL BAR AXIS SCALE LABELS IF 1 OF 2 MEASURES IN 1ST CELL IS NULL
bug 13873903 - PAGE PROMPT IN TRELLIS FIX IN QUERYMANAGER
bug 13874870 - BACKPORT FIX FOR BUG 13874870 TO 11.1.1.6.2BP1
bug 13876104 - BLANK DESCRIPTIONS CAUSE WEBCAT VERIFY+CONFLICT DETECTION ISSUES DURING PATCHING
bug 13878720 - QA THE BI FORMATS CONTAINS DELIMITER CAN NOT BE SEEN AFTER PRINT MAP TO PDF OR HTML
bug 13879704 - BI-EXTENDER : RPD HAS CONSISTENCY ERRORS AFTER IMPORT/LOGICAL LAYER MAPPING
bug 13887797 - ESSBASE:CS:WB: DELETE THROWS UNKNOWN MEMBER [PROFITMARGINSALESCOGSTOTAL]
bug 13888163 - dashboard prompt incorrectly sets to code value instead of display value
bug 13888594 - AGGRADVISOR.XML FILE IS MISSING WHEN INSTALLED SEPARATE BI DEVELOPER
bug 13889332 - BIQA SYBASE - UNABLE TO LOAD THE DLL LIBODBC64.SO
bug 13889878 - SUMMARY ADVISOR WIZARD CRASHES ADMIN TOOL AFTER DISPLAYING FATAL ERROR
bug 13892131 - PRESENTATION LAYER FOLDERS STRUCTURE DISAPPEARING AFTER IMPORTING DFF VO
bug 13892713 - BI EXTENSION DELETING THE JOINS BETWEEN THE VO'S ALREADY PRESENT IN THE RPD
bug 13893533 - ISHIDDEN CHECK MISSING COMPATIBILITY GUARD IN A COUPLE OF PLACES
bug 13893765 - CALCITEM EDITOR DOES NOT ALLOW COUNTDISTINCT IN CUSTOMFORMULA
bug 13895354 - MODELCHECKER THROWS INVALID ARGUMNENT WAS ENCOUNTERED ERR MSG
bug 13897448 - filter on a column with a fomular created by bin hangs
bug 13897745 - ESSBASE:CS:INTERNAL ERROR THROWN FOR QUERY WITH FILTER ON ESSBASE AGGREGATE LTS
bug 13899403 - WHEN ADD A CONDITION USING SWEDISH CHARACTERS THROWS NO RESULTS
bug 13900290 - ORA-22835 ENCOUNTERED WHEN RUNNING SUMMARY ADVISOR
bug 13904028 - PREVIEW DISPLAY ISSUE WITH SPARK CHART DISPLAY FOR DUPLICATE LAYER
bug 13906706 - PIVOT TABLE LAYOUT ISSUE WITH SORTED HIERARCHICAL VALUES
bug 13907309 - QA:RGRN CONSISTENCY CHECK FAILED.
bug 13908761 - QA POPUP MENU MENU ON MAP VIEW SHOULD BE DISAPPEAR AFTER CHANGE THE ZOOM LEVEL
bug 13910649 - RESTORE TT OPTIMIZER HINTS
bug 13915270 - qa: positional calc item sum no return result, invaliddatatypevalueexception
bug 13920994 - SERVER GENERATED CORE FILES WHILE QA TESTING
bug 13921356 - BIEXTENDER: FIX QUOTE ISSUE WHEN RUNNING ON LINUX
bug 13921437 - PSR SUBTOTAL CALCULATION IMPACTS PERFORMANCE IN OBIEE 11.1.1.6 UPON UPG FROM 10G
bug 13921910 - QA ADD OR REMOVE THRESHOLD WILL SET LINE WIDTH BACK TO THE DEFAULT VALUE
bug 13922366 - SEARCH A MEMBER IS NOT WORKING FOR HIER COL PROMPTS WITH SPECIFIC COLUMN VALUES
bug 13927428 - AGGR PERSIST CRASHES WHEN LOGGING ERROR MESSAGE DURING PUBLISH TO CLUSTER
bug 13927538 - HARDCODED STRINGS FOR MY LOCATION TOOLTIP IN MOBILE MAPS
bug 13929634 - Fix for 13929634
bug 13932237 - TRELLIS PNG SYMBOL DISPLAY IF FILTER/SELECTION RESULT IN NO MEMBR IN GROUPBY
bug 13935345 - QA IPAD CONTEXT MENU NOT RENDERING CORRECTLY WHEN FOLDER HEADING TITLE IS LONG
bug 13936266 - QA: SECONDARY TOOLTIP SHOWS UNDEFINED ERROR IN MAP VIEWS
bug 13936498 - NEED TO EXPOSE SINGLESTREAMHTML DOWNLOAD VIA WS API ENDPOINT
bug 13941416 - IMPORT ERROR FOR SAP TWO STRUCTURES CUBE
bug 13941439 - SMA HAS SIGNIFICANT MEMORY OVERHEAD MANAGING BLOCK LISTS
bug 13941525 - ADD ABILITY TO SCALE SMA BLOCK ALLOCATION SIZES
bug 13941730 - NO VIEW RETURNED AFTER 2 HIER DRILL/EXPAND ON 2 EDGES OF SIMPLE TRELLIS
bug 13942200 - qa: ie8: ie9: column name tile controls show though calc item and format dialogs
bug 13943851 - nls:reg:hierarchy column not work if the localized name contain single quote
bug 13944009 - INCORRECT REPORT LINK GETS GENERATED IN IE8
bug 13945570 - DESCRIPTOR ID REPLACES LOGICAL COLUMN IN TITLE OF EXPORTED REPORT
bug 13950643 - PS BRIEF CRASH/500 ERROR IF 3 SPECIFIC TRELLIS VIEWS ON DASHBOARD PAGE
bug 13956072 - PROBLEM WITH UNION,PIVOT TABLE,AND NEW CALCULATED ITEMS
bug 13956434 - QA:RGRN:BI CATALOG SEARCH BISEARCH INTEGRATION NOT WORKING IN BISHIPHOME_MAIN
bug 13957578 - ADD API FOR MOBILE CLIENT TO CLOSE EXPANDED VIEWS
bug 13960774 - QA PRINTING MAP VIEW WITH LINE FORMAT NOT WORKING WHEN LINE WIDTH IS 10 PXS WIDE
bug 13961902 - qa ipad mutliple pages list not displayed at dashboard header
bug 13966114 - rup3st5cdrm: presentation variable is lost in 2nd level report navigation
bug 13966291 - QA: ERROR IF SUM CALC ITEM MOVED TO PAGE/PROMPT EDGE OF PIVOT
bug 13967932 - IE SLOW, CONSUMING CPU AND APPEARS TO HANG EDIT ANALYSIS, COMPARED TO FF
bug 13971915 - QA IPAD CONTEXT MENU TURNS BLACK WHEN CLICKED BACK BUTTON ON DASHBOARD
bug 13972011 - GUID WITH BACKSLAH DOES NOT WORK PROPERLY DURING LOGIN.
bug 13972487 - assertion failure promptfiltervaluuevisitor.cpp accessing 11.1.1.6 dashboards
bug 13973660 - contain operator and variable :assertion failure: !lastexpressionpointless()
bug 13977248 - ERROR DURING CLOSING TO GATEWAY MAY CAUSE HANGING.
bug 13982971 - PERMISSIONS ON WEB CATALOG OBJECTS NOT APPLIED IMMEDIATELY
bug 13983360 - OBIEE SERVER DIES AFTER CONSOLE LOGOFF EVENT
bug 13983484 - VARIOUS TOOLS HAVE ECHO FOR PASSWORD PROMPT
bug 13984932 - FUSIONBI: ISSUES WITH BI EXTENDER FOR KFF
bug 13986374 - BI SERVER WITH SAP BW 7.0 CRASHES AFTER HIGH MEMORY & CPU UTILIZATION
bug 13987140 - QA IPAD CONTEXT MENU DO NOT DISMISSED WHEN HOLD THE OTHER FINGER IN SAME CELL
bug 13989826 - STRANGE REPORT SQL GENERATED WITH MORE THAN SEVEN REPORT FILTERS
bug 13993383 - QAEMPTY UNTITLED TAB DISPLAYS IF TRY CREATE NEW FILTER FROM MAIN TOOLBAR
bug 13993477 - CONTINUOUS FORMATS ARE NOT CORRECTLY BINNED
bug 13994110 - variables cannot be used in column selector
bug 13996742 - <EXPOSE-TESTPAGE> MUST BE SET TO FALSE IN ADMINSERVICE ORACLE-WEBSERVICES.XML
bug 13998652 - ADMINSERVICE FAILS FOR SUBJECT AREA WITH LOGICALLEVEL + DIMENSION CONTENT
bug 14007380 - TEXT DATA IS SHOWING AS JUNK IN OBIEE 11.1.1.6.0 WITH TERADATA 13.10.02.02
bug 14011040 - direct db req report are not refereshed when prompt value changes in dashboard
bug 14012520 - KFF PRESENTATION LAYER EXTENSION FOR QUALIFIED SEGMENT DIMENSIONS
bug 14013626 - LARGE PIVOT TABLE SHOWS WRONG DATA IN COLUMNS WHEN EXPORTED TO EXCEL
bug 14019207 - SA:STALE STATS CHECK SHOULD CHECK FOR STALE_STATS COLUMN IN USER_TAB_STATISTICS
bug 14021534 - DASHBOARD PROMPT DISAPPEAR ON Customization References Dead CacheID
bug 14023640 - qa: filter view on dashboard link to view saved measure filter definiton no work
bug 14025087 - UNCHECK 'SHOW APPLY BUTTON' CAUSE PROBLEM ON RESTRICTED DASHBOARD PROMPT COLUMN
bug 14026719 - ACCESS:JAWS:USER IS NOT NOTIFIED THE DASHBOARD PAGE NAME WHEN FOCUS ON
bug 14027230 - unable to execute action after clicking the action link from the excel sheet
bug 14033090 - in view selector, some views in conditional section need to be refreshed
bug 14037198 - QA: ERROR IF 2 CALC ITEMS/GROUPS MOVED TO PAGE/PROMPT EDGE OF PIVOT
bug 14038708 - CONSISTENCY CHECK CORRUPTS COMPLEX PHYSICAL JOIN EXPRESSION
bug 14040587 - OPENING WEB QUERY .IQY FILE IN EXCEL SHOWS JUNK CHARACTERS.
bug 14042858 - UPGRADE ASSISTANT FAILED BECAUSE OF ASKING FOR PASSWORD.
bug 14044700 - qa: filter incorrectly lists edited column formula 2nd bin name, error
bug 14045275 - OTBI NEEDS TO SUPPORT FLEXFIELDS REPORTING FOR SAAS CUSTOMERS
bug 14048312 - RESET>LAST APPLIED VALUE IS NOT WORKING FOR SLIDERS IN PARTICULAR CASE
bug 14055091 - QA: IPAD: ASENG: PROMPTS: NULL OPTION SHOWS RANDOM VALUE IN BOX
bug 14059233 - NEXT BUTTON IS NOT WORKING AS EXPECTED IN MULTI PROMPT PAGE
bug 14059302 - QA IPAD DOUBLE TAP ON MAP SHOWS ERROR MESSAGE
bug 14063997 - SUBQUERY CONTAINS TOO MANY VALUES .. ERROR IN 11.1.1.6
bug 14068753 - SAPBW: TEST CASE VH_DRILL_WITH_MEASURE_SIMPLE_FILTER_PAD CRASHES SERVER
bug 14070348 - IBOTS CALLING JAVA PROGRAM NOT WORKING IN CLUSTERED ENVIRONMENT
bug 14070543 - HANDLE CASE-SENSITIVE NATURE OF ORACLE DB IN CHECKING IF TABLE STATS ARE STALE
bug 14075098 - CHANGE THE DEFAULT TIMEOUT OF BI SECUIRTY SERVICE TO 2 MINUTES.
bug 14077926 - RUP4 - SAXPARSEEXCEPTION XML ELEMENT TYPE MISMATCH
bug 14082250 - criteria column icon as measure for treat as attribute
bug 14082430 - DEFAULT SELECTION FOR A COLUMN IN DASHBOARD PROMPT DOES NOT APPEAR AFTER BP2
bug 14086868 - SINGLE MEMBER REFERENCE FILTER USING CUSTOM GROUP ON THE SLICER FOR ESSBASE
bug 14091259 - PATCHRPD IS GIVING ERROR [94043] PROJECTS EQUALIZATION FAILED WITH -I OPTION
bug 14096957 - CONNECTION KEY HAS CHANGED WHEN DELETE AN OBJECT FROM PHYSICAL LAYER
bug 14104489 - QUERIES USING SA_SAMPLING_USE_EXPECTED_CARDINALITY=1 PRODUCED WRONG RESULTS
bug 14108109 - conditionMet xml error while saving current customizations
bug 14109572 - CRASH: MEMORY CORRUPTION IN BINARY FIELD SUPPORT IN BIPS
bug 14113828 - POST APPLYING 11.1.1.6.3 BIFNDN PATCH, PRODUCT VERSION DISPLAYED AS 11.1.1.6.2
bug 14115825 - DFF ATTRIBUTES NOT GETTING EXPOSED TO ALL PRESENTATION SUBJECT AREAS
bug 14116160 - DASHBOARD PROMPT VALUES DOES NOT PRINT FOR HTML
bug 14116839 - MUDE: CONNECTION POOL MASTER REPOSITORY IS MODIFIED WHEN YOU PUBLISH TO NETWORK
bug 14135397 - ERROR OAMP2OPY:ACIOA5LN WHEN SORT WITH HIERARCHY IN PIVOT TABLE
bug 14137805 - BI SERVER CRASH WHEN REPORT TOTAL HAVING DUP CONST IN BY
bug 14138421 - CATALOGMANAGER.ZIP NEEDS TO BE UNDER BISHIPHOME/DIST/CLIENTS/BIPRESENTATIONSERVE
bug 14139644 - STRESS:FA:PRJ THREAD CONTENTION IN BIP SERVER DURING CAPTURE PROJECT COST TEST
bug 14146026 - % VALUE CALCULATED IS INCORRECT WHEN INSTANCE UPGRADED FROM 11.1.1.5.0 TO 6.2BP1
bug 14146950 - decimal sign in italian is wrong in tab delimited download after patch 13986088
bug 14147801 - MEASURES ARE NOT AGGREATED BY THE DIMENSION COLUMNS WITH CASE STATEMENT IN IT
bug 14151619 - BIAPPS EXTENDER RULE FILE CHECKIN2
bug 14154023 - GB CLAUSE WITH MULTIDIM EXPRESSIONS NOT SIMPLIFIED IN THE NAVIGATED REQUEST
bug 14154360 - NOT STRESS:FA:CRM SLOW RUNNING ANAJDBCSTATEMENTIMPL.INTERNAL_CLOSE - DEADLOCK
bug 14154426 - NEGATIVE TEST:PATCHRPD CRASH IF INCORRECT INPUT ORIG/CUST RPD NAME ARE PROVIDED
bug 14158517 - BIPS CRASHING AT VIEWLAYOUTBUILDERUTIL::XML2DRILLSTEP+0X8109
bug 14159610 - ADDING REPORT TO BRIEFING BOOK WITH COLUMN SELECTOR RESULTS IN SAWSERVER CRASH
bug 14163224 - THE INCORRECT ROW TO BE ADDED
bug 14164430 - PSR:PERF:BI:SAS COLUMN ORDERING NOT HAPPENING CORRECTLY RESULTING IN CACHE MISS
bug 14170374 - OBIEE KEEPS WRITING [NQSERROR: 12008] MESSAGES TO SYSLOG
bug 14174457 - SAWSERVER CRASH IN FILTERUTILS::FINDFILTERBYCOLUMNFORMULA
bug 14181830 - UNABLE TO SHOW THE VALUES AS PERCENTAGE FOR A COLUMN, ERRORS OUT
bug 14188181 - bi-lrg mats_rup4_pillar 13 diffs otbi icon cannot be found on page
bug 14196875 - ROLE PLAYING DIMENSIONS OF GL ACCOUNT SHOULD NOT BE SHOWN IN THE MAPPING UI
bug 14203469 - PATCHRPD TRIES TO DELETE AN OBJECT WHICH HAS BEEN ALREADY BEEN DELETED
bug 14213424 - SUMMARY ADVISOR NOT PICK POTENTIAL AGGR IF SOURCECELLLEVELIDVECTOR IS DEFAULT
bug 14214357 - RPD GCC ERRORS AFTER 10G TO 11G UPGRADE - NAME WITH LEADING OR TRAILING SPACE(S)
bug 14227363 - obiee excel reports delivered though an agent are unreadable
bug 14228686 - COLUMN VALUE SUPPRESSION DOES NOT APPLY IN COLUMN SELECTOR VIEW
bug 14228975 - error codes: recursion limit exceeded when using saved filters
bug 14229707 - SUMMARY ADVISOR MISSES A RECOMMENDATION DUE TO NQSERROR 14020 DURING SAMPLING
bug 14232829 - DASHBOARD REPORT LINKS GOING TO THE WRONG COMPOUND VIEW WHEN CLICKED FOR THE FI
bug 14233806 - ENABLING ORACLE SSO (OAM) BREAKS ACT AS PROXY FUNCTIONALITY IN OBIEE11.1.6.1
bug 14241997 - RULE FILE BASE BUG FOR HCM RULE FILE CHECKIN
bug 14243759 - ISSUE: FILTER BASED ON THE RESULTS OF ANOTHER REQUEST
bug 14245163 - BIPS CRASH AT REPORTLAYOUTMODELIMPL::SETPAGESTATE(SAW::VIEWLAYOUT*)
bug 14249563 - 'SIGN OUT' OPTION DISAPPEARS IN AN OBIEE 11.1.1.6.1 ENVIRONMENT (VIA EBS)
bug 14257036 - LEADING AND TRAILING SPACE CC ERRORS SHOULD AUTO-CORRECT
bug 14257065 - CATALOG UPGRADE FROM 11.1.1.3 TO 11.1.1.6.2 NOT WORKING
bug 14259339 - PSR:FUNC:BI OBIPS CRASH IN MESSAGETABLECOMPILEDMESSAGE ON RUP4 ST1 CDRM1 ENV.
bug 14273414 - BASE BUG FOR APP SEGMENT RULE FILE CHECKIN
bug 14274454 - BI SERVER CRASHES TWICE A WEEK
bug 14276169 - EXPORT TO EXCEL OR PDF IS NOT WORKING IN IE8 ON FIRST CLICK OF THE EXPORT LINK.
bug 14277743 - COMMAND LINE UTILITY FOR BI EXTENDER
bug 14293627 - INCORRECT LTS SAMPLING QUERY ISSUED BY SUMMARY ADVISOR
bug 14301662 - EXPORTED EXCEL- LINES ARE MISSING ON 11.1.1.6.2BP1
bug 14302133 - UNABLE TO EDIT KPI STATES IF CUSTOM EXPRESSION USED FOR SCORE
bug 14303039 - ADMIN WEBSERVICE JOB IMPLEMENTATION FAILS TO EXECUTE
bug 14309744 - TAKE BI ADMIN SERVER AND PORT AS INPUTS FOR EXTENDER ESS JOB
bug 14310664 - QA:KFF VOS NOT GETTING MAPPED TO LOGICAL LAYER WHEN RAN BISERVEREXTENDER UTILITY
bug 14319835 - NQSERROR 96002 ESSBASE ERROR INPUT MDX QRY TOKEN 'CROSSJOIN' IN 11.1.1.6.2BP1
bug 14324595 - Biserverxmlexec fails to create LTS folder for logical tables
bug 14325240 - CUSTOM NUMERIC FORMAT 00:00:00 NOT EXPORTED TO EXCEL IN 11.1.1.6.2BP1
bug 14335552 - SAX PARSER EXCEPTION THROWN WHEN CREATING SUBSTRING EXPRESSIONS
bug 14335601 - OBIEE 11G TOTAL OF COUNT DISTINCT COLUMN NOT CORRECT WHEN A COLUMN IS EXCLUDED
bug 14342137 - TABLE VIEW WITH PROMPT HAS VIEW DISPLAY ERROR: DLEDGESLICES.CPP
bug 14342741 - BI EXTENDER SYNC RESULTS IN CONSISTENCY ERRORS
bug 14349315 - INCONSISTENT BEHAVIOUR IN SLIDER PROMPTS INTRODUCED IN 11.1.1.6.2
bug 14350128 - DRILLING NOT WORKING WHEN USING SERVER VARIABLE IN PROMPT - NUMERIC VALUE ERROR
bug 14350868 - CREATE ALIAS OF DFF VO AND ADD TO LTS INSTEAD OF THE BASE DFF VO
bug 14351306 - SHOW DATA AS PERCENTAGE OF GENERATES ERROR AFTER APPLYING 11.1.1.6.2 BP1
bug 14351575 - After 11.1.1.62 BP1, occationally a value is skipped when exporting to excel
bug 14352647 - ACTION LINK ON GRAPH FROM PIVOT TABLE DOES NOT PASS FILTERS IN 11.1.1.6.2BP1
bug 14354251 - FILTEREXPRSQLVISITOR.CPP ERROR WHEN TRYING TO NAVIGATE BETWEEN PAGES
bug 14362795 - CRASH IN QDRXML WITH CERTAIN DRILL STEPS
bug 14379318 - SERVER CRASHES AFTER APPLY BP1 FOR 11.1.1.6G
bug 14389433 - row-wise initialized session variable should not be eval'ed during navigation
bug 14399538 - ASENG SAWSERVER CRASH IN FORMATENGINE::ADDSTYLETOCACHE
bug 14405668 - CONDITIONS NOT WORKING AFTER APPLYING 11.1.1.6.2BP1
bug 14456047 - filters are not getting passed in pivot table after applying fix for 14222286
bug 14460639 - CONCATENATED MEMBER NAME AND ALIAS HIERARCHY LEVEL COLUMNS USING ESSBASE
bug 14461064 - INCORRECT WRITEBACK TEMPLATES USED WHEN DASHBOARD HAS MULTIPLE REPORTS
bug 14468408 - QA CHROME CHART TEXT/LEGENDS ARE DISTORTED AND NOT READABLE
bug 14474347 - REMOVE NON-ORACLE FILE FROM APP DIRECTORY
bug 14478215 - BRIEFING BOOKS ISSUES WITH PROMPT SELECTIONS, NOT CORRECT IN BB
bug 14480101 - CRASH IN SPATIALMAPMDMANAGER SHUTDOWN
bug 14480353 - MOVE COLUMNS ON INTERACTION TAB FOR ANALYSIS PROPERTIES NOT WORKING
bug 14484236 - DIRECT CONNECTION TO SQL SERVER DATABASE WITHOUT DEFINING A DSN
bug 14486957 - SUB TOTAL (LABELS ONLY) WORKS INCORRECTLY WHEN COLUMNS ARE HIDDEN
bug 14496628 - JOIN DIALOG/EXPRESSION BUILDER SHOULD CHECK FOR INVALID COMPLEX JOIN EXPRESSION
bug 14502193 - RPD MIGRATION FROM 11.1.1.5 TO 11.1.1.6 HAS UNMAPPED THE MAPPING FOR BASE FACT
bug 14503598 - AGO AND TODATE FUNCTION NOT WORKING WITH ESSBASE CUBE
bug 14514491 - SESSION NQID IS NOT CREATED CORRECTLY WITH USER /PASSWORD ON URL 11.1.1.6.2BP1
bug 14520731 - CRASH IN DVTDEFAULTLINEBARCHARTLAYOUT::POPULATELAYOUTMESSAGE
bug 14586268 - NQCMD IMPERSONATION ON LINUX IS NOT ACCEPTING PUSHED BISYSTEMUSER PASSWORD
bug 14616732 - DISPLAY OF LARGE TABE/PIVOT VIEW IN DASHBOARD HANGING IE 8 BROWSER
bug 14646100 - count(distinct) might produce incorrect result after fix of 14220560
bug 14652408 - qa: ipad: upg: drill is not working on graph

Patch 14733370 (7 of 7) Oracle Business Intelligence Platform Client Installers and MapViewer

bug 13794002 - bishiphome 11.1.1.6.2 cumulative patch 1
bug 14712346 - 11.1.1.6.5 CLIENT INSTALLER AND MAPVIEWER PATCH

8 comments:

  1. I have a problem on obiee 11.1.1.6.2 BP1 and I would to know if is resolution on obiee 11.1.1.6.4 or 11.1.1.6.5 (On 11.1.1.5.0 it worked...)

    Scenario is:

    I have a image mapping that some parts of this image goes to different pages of my dashboard. Every part has a link with presentation variable that load on prompt of pages. so prompt is loaded by link. Problem is that I hav e to apply this prompt in destination page to see results. In version 11.1.1.5.0 this apply was automatically. Now I need to get this automatically because users don't see this prompt (display:none in that section).

    Could you tell me about it?

    ReplyDelete
  2. Thanks so much for the timely update on bug fix. Helped me at right time. OBIEE Online Training

    ReplyDelete
  3. Was this fixed or any workaround for it?

    ReplyDelete
  4. thanks admin,

    Clipping Paths are used to outline objects from the background of an image.
    You can use a clipping path service to have parts of an image made transparent,
    while are parts are made opaque. This process is usually employed to hide the
    background of an image, but it is not limited to that alone.

    ReplyDelete
  5. Thanks admin.
    Social media is a great power and biggest community now a day. Facebook is most popular social site in the world. So Facebook fans are most important for get more traffic for your web site and community. So buy facebook fans and enjoy your community.

    ReplyDelete
  6. Hi Admin:
    I have a problem when i use the presentation variable into a dashboard and i use it into the request as a prompt and into a field.
    Into the field the presentation variable show the expected result but i dont know why as "is prompted" is not working.
    can you help me on this?
    Thanks in advance

    ReplyDelete
  7. Thanks Deva,
    I've encounter a issue in BIP when working with date type parament in LOVs. Scenarios :
    I have to create a LOVs with a date type parameter such as
    "Select emp_name From Employee Where birthday = :pdate" But I got a error " date cannot be null". I wonder this issue is fixed ?
    Thanks again Deva

    ReplyDelete